{"text_format":"1","workbook":"xlsx","n_sheets":10,"sheets":["Runde","Daten","Seidl","Übersicht","Statistik1","Statistik2","Statistik3","Abstände","Tippschein","Parameter"],"not_rendered":{"charts":5,"images":0,"macros":1,"external_links":0,"defined_names":10,"comments":0,"pivot_tables":0},"unopened":[],"bounds":{"document_bytes":16777216,"sheet_cells":100000,"rows_first":2000,"rows_last":500,"rows_between":2000,"halvings":0,"cell_chars":16384,"cell_head_chars":4096},"cells_cut":0,"cells_raw":0,"read":"whole","date_system":"1900"}

{"sheet":"Runde","index":0,"n_rows":15,"n_cols":133,"rows_kept":15,"cut":false,"hidden":false,"merged":[[0,2,0,5],[0,6,0,17],[0,18,0,20],[0,21,0,26],[1,6,1,7],[1,8,1,9],[1,10,1,11],[1,12,1,13],[1,14,1,15],[1,16,1,17],[1,4,1,5],[12,18,12,20],[13,18,13,20],[14,18,14,20],[11,4,11,5],[11,6,11,7],[11,8,11,9],[11,10,11,11],[11,12,11,13],[11,18,11,20],[12,4,12,5],[12,6,12,7],[12,8,12,9],[12,10,12,11],[12,12,12,13],[13,4,13,5],[13,6,13,7],[13,8,13,9],[13,10,13,11],[13,12,13,13],[14,4,14,5],[14,6,14,7],[14,8,14,9],[14,10,14,11],[14,12,14,13],[14,16,14,17],[11,16,11,17],[12,14,12,15],[12,16,12,17],[13,14,13,15],[13,16,13,17],[11,14,11,15],[14,14,14,15]]}
[{"$f":"Parameter!B15 & \" Rd\"","v":"26/27 Rd"},1,{"$f":"COUNTA(E3:E11)","v":0},null,null,null,"Tipps",null,null,null,null,null,null,null,null,null,null,null,"Anzahl",null,null,"Punkte",null,null,null,null,null,null,null,null,null,null,null,null,null,null,null,null,null,null,null,null,null,null,null,null,null,null,null,null,null,null,null,null,null,null,null,null,null,null,null,null,null,null,null,null,null,null,null,null,null,null,null,null,null,null,null,null,null,null,null,null,null,null,null,null,null,null,null,null,null,null,null,null,null,null,null,null,null,null,null,null,null,null,null,null,null,null,null,null,null,null,null,null,null,null,null,null,null,null,null,null,null,null,null,null,null,null,null,null,null,1,0]
["Zeit","Sp","Team 1","Team 2","Erg.",null,{"$f":"Parameter!C1","v":"MA"},null,{"$f":"Parameter!D1","v":"MN"},null,{"$f":"Parameter!E1","v":"AH"},null,{"$f":"Parameter!F1","v":"KS"},null,{"$f":"Parameter!G1","v":"LM"},null,{"$f":"Parameter!H1","v":"EN"},null,1,2,"X",{"$f":"G2","v":"MA"},{"$f":"I2","v":"MN"},{"$f":"K2","v":"AH"},{"$f":"M2","v":"KS"},{"$f":"O2","v":"LM"},{"$f":"Q2","v":"EN"},null,null,null,null,null,null,null,null,null,null,null,null,null,null,null,null,null,null,null,null,null,null,null,null,null,null,null,null,null,null,null,null,null,null,null,null,null,null,null,null,null,null,null,null,null,null,null,null,null,null,null,null,null,null,null,null,null,null,null,null,null,null,null,null,null,null,null,null,null,null,null,null,null,null,null,null,null,null,null,null,null,null,null,null,null,null,null,null,null,null,null,null,null,null,null,null,null,null,null,null,null,null,null,null,2,1]
["Fr 20:30",1,null,null,null,null,null,null,null,null,null,null,null,null,null,null,null,null,null,null,null,null,null,null,null,null,null,null,null,null,null,null,null,null,null,null,null,null,null,null,null,null,null,null,null,null,null,null,null,null,null,null,null,null,null,null,null,null,null,null,null,null,null,null,null,null,null,null,null,null,null,null,null,null,null,null,null,null,null,null,null,null,null,null,null,null,null,null,null,null,null,null,null,null,null,null,null,null,null,null,null,null,null,null,null,null,null,null,null,null,null,null,null,null,null,null,null,null,null,null,null,null,null,null,null,null,null,null,null,null,null,"X",2]
["Sa 15:30",2,null,null,null,null,null,null,null,null,null,null,null,null,null,null,null,null,null,null,null,null,null,null,null,null,null,null,null,null,null,null,null,null,null,null,null,null,null,null,null,null,null,null,null,null,null,null,null,null,null,null,null,null,null,null,null,null,null,null,null,null,null,null,null,null,null,null,null,null,null,null,null,null,null,null,null,null,null,null,null,null,null,null,null,null,null,null,null,null,null,null,null,null,null,null,null,null,null,null,null,null,null,null,null,null,null,null,null,null,null,null,null,null,null,null,null,null,null,null,null,null,null,null,null,null,null,null,null,null,null,null,3]
["Sa 15:30",3,null,null,null,null,null,null,null,null,null,null,null,null,null,null,null,null,null,null,null,null,null,null,null,null,null,null,null,null,null,null,null,null,null,null,null,null,null,null,null,null,null,null,null,null,null,null,null,null,null,null,null,null,null,null,null,null,null,null,null,null,null,null,null,null,null,null,null,null,null,null,null,null,null,null,null,null,null,null,null,null,null,null,null,null,null,null,null,null,null,null,null,null,null,null,null,null,null,null,null,null,null,null,null,null,null,null,null,null,null,null,null,null,null,null,null,null,null,null,null,null,null,null,null,null,null,null,null,null,null,null,4]
["Sa 15:30",4,null,null,null,null,null,null,null,null,null,null,null,null,null,null,null,null,null,null,null,null,null,null,null,null,null,null,null,null,null,null,null,null,null,null,null,null,null,null,null,null,null,null,null,null,null,null,null,null,null,null,null,null,null,null,null,null,null,null,null,null,null,null,null,null,null,null,null,null,null,null,null,null,null,null,null,null,null,null,null,null,null,null,null,null,null,null,null,null,null,null,null,null,null,null,null,null,null,null,null,null,null,null,null,null,null,null,null,null,null,null,null,null,null,null,null,null,null,null,null,null,null,null,null,null,null,null,null,null,null,null,5]
["Sa 15:30",5,null,null,null,null,null,null,null,null,null,null,null,null,null,null,null,null,null,null,null,null,null,null,null,null,null,null,null,null,null,null,null,null,null,null,null,null,null,null,null,null,null,null,null,null,null,null,null,null,null,null,null,null,null,null,null,null,null,null,null,null,null,null,null,null,null,null,null,null,null,null,null,null,null,null,null,null,null,null,null,null,null,null,null,null,null,null,null,null,null,null,null,null,null,null,null,null,null,null,null,null,null,null,null,null,null,null,null,null,null,null,null,null,null,null,null,null,null,null,null,null,null,null,null,null,null,null,null,null,null,null,6]
["Sa 15:30",6,null,null,null,null,null,null,null,null,null,null,null,null,null,null,null,null,null,null,null,null,null,null,null,null,null,null,null,null,null,null,null,null,null,null,null,null,null,null,null,null,null,null,null,null,null,null,null,null,null,null,null,null,null,null,null,null,null,null,null,null,null,null,null,null,null,null,null,null,null,null,null,null,null,null,null,null,null,null,null,null,null,null,null,null,null,null,null,null,null,null,null,null,null,null,null,null,null,null,null,null,null,null,null,null,null,null,null,null,null,null,null,null,null,null,null,null,null,null,null,null,null,null,null,null,null,null,null,null,null,null,7]
["Sa 18:30",7,null,null,null,null,null,null,null,null,null,null,null,null,null,null,null,null,null,null,null,null,null,null,null,null,null,null,null,null,null,null,null,null,null,null,null,null,null,null,null,null,null,null,null,null,null,null,null,null,null,null,null,null,null,null,null,null,null,null,null,null,null,null,null,null,null,null,null,null,null,null,null,null,null,null,null,null,null,null,null,null,null,null,null,null,null,null,null,null,null,null,null,null,null,null,null,null,null,null,null,null,null,null,null,null,null,null,null,null,null,null,null,null,null,null,null,null,null,null,null,null,null,null,null,null,null,null,null,null,null,null,8]
["So 15:30",8,null,null,null,null,null,null,null,null,null,null,null,null,null,null,null,null,null,null,null,null,null,null,null,null,null,null,null,null,null,null,null,null,null,null,null,null,null,null,null,null,null,null,null,null,null,null,null,null,null,null,null,null,null,null,null,null,null,null,null,null,null,null,null,null,null,null,null,null,null,null,null,null,null,null,null,null,null,null,null,null,null,null,null,null,null,null,null,null,null,null,null,null,null,null,null,null,null,null,null,null,null,null,null,null,null,null,null,null,null,null,null,null,null,null,null,null,null,null,null,null,null,null,null,null,null,null,null,null,null,null,9]
["So 17:30",9]
[null,null,null,{"$f":"B1","v":1},null,null,null,null,null,null,null,null,null,null,null,null,null,null,{"$f":"B1","v":1},null,null,{"$f":"ROUND(SUM(V3:V11),1)","v":0},0,0,0,0,0,null,{"$f":"RANK(V12,$V12:$AA12)","v":1},{"$f":"RANK(W12,$V12:$AA12)","v":1},1,1,1,1]
[null,null,null,"Herbst",null,null,null,null,null,null,null,null,null,null,null,null,null,null,"Herbst",null,null,0,0,0,0,0,0,null,1,1,1,1,1,1]
[null,null,null,"Frühjahr",null,null,null,null,null,null,null,null,null,null,null,null,null,null,"Frühjahr",null,null,0,0,0,0,0,0,null,1,1,1,1,1,1]
[null,null,null,{"$f":"Parameter!B15","v":"26/27"},null,null,null,null,null,null,null,null,null,null,null,null,null,null,{"$f":"D15","v":"26/27"},null,null,{"$f":"IF($B$1>17,V14+V13,0)","v":0},0,0,0,0,0,null,1,1,1,1,1,1]

{"sheet":"Daten","index":1,"n_rows":308,"n_cols":40,"rows_kept":308,"cut":false,"hidden":true,"merged":[[1,34,1,37],[1,22,1,25],[1,28,1,31],[0,15,0,16],[0,17,0,18],[0,0,0,4],[0,7,0,8],[0,9,0,10],[0,11,0,12],[0,13,0,14],[0,5,0,6]]}
[{"$f":"Parameter!B15","v":"26/27"},null,null,null,null,"Erg",null,{"$f":"Parameter!C1","v":"MA"},null,{"$f":"Parameter!D1","v":"MN"},null,{"$f":"Parameter!E1","v":"AH"},null,{"$f":"Parameter!F1","v":"KS"},null,{"$f":"Parameter!G1","v":"LM"},null,{"$f":"Parameter!H1","v":"EN"},null,null,null,null,{"$f":"Parameter!C1","v":"MA"},{"$f":"Parameter!D1","v":"MN"},{"$f":"Parameter!E1","v":"AH"},{"$f":"Parameter!F1","v":"KS"},{"$f":"Parameter!G1","v":"LM"},{"$f":"Parameter!H1","v":"EN"},{"$f":"Parameter!C1","v":"MA"},{"$f":"Parameter!D1","v":"MN"},{"$f":"Parameter!E1","v":"AH"},{"$f":"Parameter!F1","v":"KS"},{"$f":"Parameter!G1","v":"LM"},{"$f":"Parameter!H1","v":"EN"},{"$f":"Parameter!C1","v":"MA"},{"$f":"Parameter!D1","v":"MN"},{"$f":"Parameter!E1","v":"AH"},{"$f":"Parameter!F1","v":"KS"},{"$f":"Parameter!G1","v":"LM"},{"$f":"Parameter!H1","v":"EN"}]
["Runde","Zeit","Spiel","M1","M2","H","A","H","A","H","A","H","A","H","A","H","A","H","A","Bemerkung",null,null,"Punkte in der Runde",null,null,null,null,null,"Punkte in der Saison",null,null,null,null,null,"Punkte im Jahr"]
[1,"Fr 20:30",1,null,null,null,null,null,null,null,null,null,null,null,null,null,null,null,null,null,null,null,null,null,null,null,null,null,{"$f":"SUM(W$3:W3)","v":0},{"$f":"SUM(X$3:X3)","v":0},{"$f":"SUM(Y$3:Y3)","v":0},{"$f":"SUM(Z$3:Z3)","v":0},{"$f":"SUM(AA$3:AA3)","v":0},{"$f":"SUM(AB$3:AB3)","v":0},{"$f":"SUM(W$3:W3)","v":0},{"$f":"SUM(X$3:X3)","v":0},{"$f":"SUM(Y$3:Y3)","v":0},{"$f":"SUM(Z$3:Z3)","v":0},{"$f":"SUM(AA$3:AA3)","v":0},{"$f":"SUM(AB$3:AB3)","v":0}]
[1,"Sa 15:30",2,null,null,null,null,null,null,null,null,null,null,null,null,null,null,null,null,null,null,null,null,null,null,null,null,null,{"$f":"SUM(W$3:W4)","v":0},{"$f":"SUM(X$3:X4)","v":0},{"$f":"SUM(Y$3:Y4)","v":0},{"$f":"SUM(Z$3:Z4)","v":0},{"$f":"SUM(AA$3:AA4)","v":0},{"$f":"SUM(AB$3:AB4)","v":0},{"$f":"SUM(W$3:W4)","v":0},{"$f":"SUM(X$3:X4)","v":0},{"$f":"SUM(Y$3:Y4)","v":0},{"$f":"SUM(Z$3:Z4)","v":0},{"$f":"SUM(AA$3:AA4)","v":0},{"$f":"SUM(AB$3:AB4)","v":0}]
[1,"Sa 15:30",3,null,null,null,null,null,null,null,null,null,null,null,null,null,null,null,null,null,null,null,null,null,null,null,null,null,{"$f":"SUM(W$3:W5)","v":0},{"$f":"SUM(X$3:X5)","v":0},{"$f":"SUM(Y$3:Y5)","v":0},{"$f":"SUM(Z$3:Z5)","v":0},{"$f":"SUM(AA$3:AA5)","v":0},{"$f":"SUM(AB$3:AB5)","v":0},{"$f":"SUM(W$3:W5)","v":0},{"$f":"SUM(X$3:X5)","v":0},{"$f":"SUM(Y$3:Y5)","v":0},{"$f":"SUM(Z$3:Z5)","v":0},{"$f":"SUM(AA$3:AA5)","v":0},{"$f":"SUM(AB$3:AB5)","v":0}]
[1,"Sa 15:30",4,null,null,null,null,null,null,null,null,null,null,null,null,null,null,null,null,null,null,null,null,null,null,null,null,null,{"$f":"SUM(W$3:W6)","v":0},{"$f":"SUM(X$3:X6)","v":0},{"$f":"SUM(Y$3:Y6)","v":0},{"$f":"SUM(Z$3:Z6)","v":0},{"$f":"SUM(AA$3:AA6)","v":0},{"$f":"SUM(AB$3:AB6)","v":0},{"$f":"SUM(W$3:W6)","v":0},{"$f":"SUM(X$3:X6)","v":0},{"$f":"SUM(Y$3:Y6)","v":0},{"$f":"SUM(Z$3:Z6)","v":0},{"$f":"SUM(AA$3:AA6)","v":0},{"$f":"SUM(AB$3:AB6)","v":0}]
[1,"Sa 15:30",5,null,null,null,null,null,null,null,null,null,null,null,null,null,null,null,null,null,null,null,null,null,null,null,null,null,{"$f":"SUM(W$3:W7)","v":0},{"$f":"SUM(X$3:X7)","v":0},{"$f":"SUM(Y$3:Y7)","v":0},{"$f":"SUM(Z$3:Z7)","v":0},{"$f":"SUM(AA$3:AA7)","v":0},{"$f":"SUM(AB$3:AB7)","v":0},{"$f":"SUM(W$3:W7)","v":0},{"$f":"SUM(X$3:X7)","v":0},{"$f":"SUM(Y$3:Y7)","v":0},{"$f":"SUM(Z$3:Z7)","v":0},{"$f":"SUM(AA$3:AA7)","v":0},{"$f":"SUM(AB$3:AB7)","v":0}]
[1,"Sa 15:30",6,null,null,null,null,null,null,null,null,null,null,null,null,null,null,null,null,null,null,null,null,null,null,null,null,null,{"$f":"SUM(W$3:W8)","v":0},{"$f":"SUM(X$3:X8)","v":0},{"$f":"SUM(Y$3:Y8)","v":0},{"$f":"SUM(Z$3:Z8)","v":0},{"$f":"SUM(AA$3:AA8)","v":0},{"$f":"SUM(AB$3:AB8)","v":0},{"$f":"SUM(W$3:W8)","v":0},{"$f":"SUM(X$3:X8)","v":0},{"$f":"SUM(Y$3:Y8)","v":0},{"$f":"SUM(Z$3:Z8)","v":0},{"$f":"SUM(AA$3:AA8)","v":0},{"$f":"SUM(AB$3:AB8)","v":0}]
[1,"Sa 18:30",7,null,null,null,null,null,null,null,null,null,null,null,null,null,null,null,null,null,null,null,null,null,null,null,null,null,{"$f":"SUM(W$3:W9)","v":0},{"$f":"SUM(X$3:X9)","v":0},{"$f":"SUM(Y$3:Y9)","v":0},{"$f":"SUM(Z$3:Z9)","v":0},{"$f":"SUM(AA$3:AA9)","v":0},{"$f":"SUM(AB$3:AB9)","v":0},{"$f":"SUM(W$3:W9)","v":0},{"$f":"SUM(X$3:X9)","v":0},{"$f":"SUM(Y$3:Y9)","v":0},{"$f":"SUM(Z$3:Z9)","v":0},{"$f":"SUM(AA$3:AA9)","v":0},{"$f":"SUM(AB$3:AB9)","v":0}]
[1,"So 15:30",8,null,null,null,null,null,null,null,null,null,null,null,null,null,null,null,null,null,null,null,null,null,null,null,null,null,{"$f":"SUM(W$3:W10)","v":0},{"$f":"SUM(X$3:X10)","v":0},{"$f":"SUM(Y$3:Y10)","v":0},{"$f":"SUM(Z$3:Z10)","v":0},{"$f":"SUM(AA$3:AA10)","v":0},{"$f":"SUM(AB$3:AB10)","v":0},{"$f":"SUM(W$3:W10)","v":0},{"$f":"SUM(X$3:X10)","v":0},{"$f":"SUM(Y$3:Y10)","v":0},{"$f":"SUM(Z$3:Z10)","v":0},{"$f":"SUM(AA$3:AA10)","v":0},{"$f":"SUM(AB$3:AB10)","v":0}]
[1,"So 17:30",9,null,null,null,null,null,null,null,null,null,null,null,null,null,null,null,null,null,null,null,null,null,null,null,null,null,{"$f":"SUM(W$3:W11)","v":0},{"$f":"SUM(X$3:X11)","v":0},{"$f":"SUM(Y$3:Y11)","v":0},{"$f":"SUM(Z$3:Z11)","v":0},{"$f":"SUM(AA$3:AA11)","v":0},{"$f":"SUM(AB$3:AB11)","v":0},{"$f":"SUM(W$3:W11)","v":0},{"$f":"SUM(X$3:X11)","v":0},{"$f":"SUM(Y$3:Y11)","v":0},{"$f":"SUM(Z$3:Z11)","v":0},{"$f":"SUM(AA$3:AA11)","v":0},{"$f":"SUM(AB$3:AB11)","v":0}]
[2,"Fr 20:30",1,null,null,null,null,null,null,null,null,null,null,null,null,null,null,null,null,null,null,null,null,null,null,null,null,null,{"$f":"SUM(W$3:W12)","v":0},{"$f":"SUM(X$3:X12)","v":0},{"$f":"SUM(Y$3:Y12)","v":0},{"$f":"SUM(Z$3:Z12)","v":0},{"$f":"SUM(AA$3:AA12)","v":0},{"$f":"SUM(AB$3:AB12)","v":0},{"$f":"SUM(W$3:W12)","v":0},{"$f":"SUM(X$3:X12)","v":0},{"$f":"SUM(Y$3:Y12)","v":0},{"$f":"SUM(Z$3:Z12)","v":0},{"$f":"SUM(AA$3:AA12)","v":0},{"$f":"SUM(AB$3:AB12)","v":0}]
[2,"Sa 15:30",2,null,null,null,null,null,null,null,null,null,null,null,null,null,null,null,null,null,null,null,null,null,null,null,null,null,{"$f":"SUM(W$3:W13)","v":0},{"$f":"SUM(X$3:X13)","v":0},{"$f":"SUM(Y$3:Y13)","v":0},{"$f":"SUM(Z$3:Z13)","v":0},{"$f":"SUM(AA$3:AA13)","v":0},{"$f":"SUM(AB$3:AB13)","v":0},{"$f":"SUM(W$3:W13)","v":0},{"$f":"SUM(X$3:X13)","v":0},{"$f":"SUM(Y$3:Y13)","v":0},{"$f":"SUM(Z$3:Z13)","v":0},{"$f":"SUM(AA$3:AA13)","v":0},{"$f":"SUM(AB$3:AB13)","v":0}]
[2,"Sa 15:30",3,null,null,null,null,null,null,null,null,null,null,null,null,null,null,null,null,null,null,null,null,null,null,null,null,null,{"$f":"SUM(W$3:W14)","v":0},{"$f":"SUM(X$3:X14)","v":0},{"$f":"SUM(Y$3:Y14)","v":0},{"$f":"SUM(Z$3:Z14)","v":0},{"$f":"SUM(AA$3:AA14)","v":0},{"$f":"SUM(AB$3:AB14)","v":0},{"$f":"SUM(W$3:W14)","v":0},{"$f":"SUM(X$3:X14)","v":0},{"$f":"SUM(Y$3:Y14)","v":0},{"$f":"SUM(Z$3:Z14)","v":0},{"$f":"SUM(AA$3:AA14)","v":0},{"$f":"SUM(AB$3:AB14)","v":0}]
[2,"Sa 15:30",4,null,null,null,null,null,null,null,null,null,null,null,null,null,null,null,null,null,null,null,null,null,null,null,null,null,{"$f":"SUM(W$3:W15)","v":0},{"$f":"SUM(X$3:X15)","v":0},{"$f":"SUM(Y$3:Y15)","v":0},{"$f":"SUM(Z$3:Z15)","v":0},{"$f":"SUM(AA$3:AA15)","v":0},{"$f":"SUM(AB$3:AB15)","v":0},{"$f":"SUM(W$3:W15)","v":0},{"$f":"SUM(X$3:X15)","v":0},{"$f":"SUM(Y$3:Y15)","v":0},{"$f":"SUM(Z$3:Z15)","v":0},{"$f":"SUM(AA$3:AA15)","v":0},{"$f":"SUM(AB$3:AB15)","v":0}]
[2,"Sa 15:30",5,null,null,null,null,null,null,null,null,null,null,null,null,null,null,null,null,null,null,null,null,null,null,null,null,null,{"$f":"SUM(W$3:W16)","v":0},{"$f":"SUM(X$3:X16)","v":0},{"$f":"SUM(Y$3:Y16)","v":0},{"$f":"SUM(Z$3:Z16)","v":0},{"$f":"SUM(AA$3:AA16)","v":0},{"$f":"SUM(AB$3:AB16)","v":0},{"$f":"SUM(W$3:W16)","v":0},{"$f":"SUM(X$3:X16)","v":0},{"$f":"SUM(Y$3:Y16)","v":0},{"$f":"SUM(Z$3:Z16)","v":0},{"$f":"SUM(AA$3:AA16)","v":0},{"$f":"SUM(AB$3:AB16)","v":0}]
[2,"Sa 18:30",6,null,null,null,null,null,null,null,null,null,null,null,null,null,null,null,null,null,null,null,null,null,null,null,null,null,{"$f":"SUM(W$3:W17)","v":0},{"$f":"SUM(X$3:X17)","v":0},{"$f":"SUM(Y$3:Y17)","v":0},{"$f":"SUM(Z$3:Z17)","v":0},{"$f":"SUM(AA$3:AA17)","v":0},{"$f":"SUM(AB$3:AB17)","v":0},{"$f":"SUM(W$3:W17)","v":0},{"$f":"SUM(X$3:X17)","v":0},{"$f":"SUM(Y$3:Y17)","v":0},{"$f":"SUM(Z$3:Z17)","v":0},{"$f":"SUM(AA$3:AA17)","v":0},{"$f":"SUM(AB$3:AB17)","v":0}]
[2,"So 15:30",7,null,null,null,null,null,null,null,null,null,null,null,null,null,null,null,null,null,null,null,null,null,null,null,null,null,{"$f":"SUM(W$3:W18)","v":0},{"$f":"SUM(X$3:X18)","v":0},{"$f":"SUM(Y$3:Y18)","v":0},{"$f":"SUM(Z$3:Z18)","v":0},{"$f":"SUM(AA$3:AA18)","v":0},{"$f":"SUM(AB$3:AB18)","v":0},{"$f":"SUM(W$3:W18)","v":0},{"$f":"SUM(X$3:X18)","v":0},{"$f":"SUM(Y$3:Y18)","v":0},{"$f":"SUM(Z$3:Z18)","v":0},{"$f":"SUM(AA$3:AA18)","v":0},{"$f":"SUM(AB$3:AB18)","v":0}]
[2,"So 19:30",8,null,null,null,null,null,null,null,null,null,null,null,null,null,null,null,null,null,null,null,null,null,null,null,null,null,{"$f":"SUM(W$3:W19)","v":0},{"$f":"SUM(X$3:X19)","v":0},{"$f":"SUM(Y$3:Y19)","v":0},{"$f":"SUM(Z$3:Z19)","v":0},{"$f":"SUM(AA$3:AA19)","v":0},{"$f":"SUM(AB$3:AB19)","v":0},{"$f":"SUM(W$3:W19)","v":0},{"$f":"SUM(X$3:X19)","v":0},{"$f":"SUM(Y$3:Y19)","v":0},{"$f":"SUM(Z$3:Z19)","v":0},{"$f":"SUM(AA$3:AA19)","v":0},{"$f":"SUM(AB$3:AB19)","v":0}]
[2,"So 17:30",9,null,null,null,null,null,null,null,null,null,null,null,null,null,null,null,null,null,null,null,null,null,null,null,null,null,{"$f":"SUM(W$3:W20)","v":0},{"$f":"SUM(X$3:X20)","v":0},{"$f":"SUM(Y$3:Y20)","v":0},{"$f":"SUM(Z$3:Z20)","v":0},{"$f":"SUM(AA$3:AA20)","v":0},{"$f":"SUM(AB$3:AB20)","v":0},{"$f":"SUM(W$3:W20)","v":0},{"$f":"SUM(X$3:X20)","v":0},{"$f":"SUM(Y$3:Y20)","v":0},{"$f":"SUM(Z$3:Z20)","v":0},{"$f":"SUM(AA$3:AA20)","v":0},{"$f":"SUM(AB$3:AB20)","v":0}]
[3,"Fr 20:30",1,null,null,null,null,null,null,null,null,null,null,null,null,null,null,null,null,null,null,null,null,null,null,null,null,null,{"$f":"SUM(W$3:W21)","v":0},{"$f":"SUM(X$3:X21)","v":0},{"$f":"SUM(Y$3:Y21)","v":0},{"$f":"SUM(Z$3:Z21)","v":0},{"$f":"SUM(AA$3:AA21)","v":0},{"$f":"SUM(AB$3:AB21)","v":0},{"$f":"SUM(W$3:W21)","v":0},{"$f":"SUM(X$3:X21)","v":0},{"$f":"SUM(Y$3:Y21)","v":0},{"$f":"SUM(Z$3:Z21)","v":0},{"$f":"SUM(AA$3:AA21)","v":0},{"$f":"SUM(AB$3:AB21)","v":0}]
[3,"Sa 15:30",2,null,null,null,null,null,null,null,null,null,null,null,null,null,null,null,null,null,null,null,null,null,null,null,null,null,{"$f":"SUM(W$3:W22)","v":0},{"$f":"SUM(X$3:X22)","v":0},{"$f":"SUM(Y$3:Y22)","v":0},{"$f":"SUM(Z$3:Z22)","v":0},{"$f":"SUM(AA$3:AA22)","v":0},{"$f":"SUM(AB$3:AB22)","v":0},{"$f":"SUM(W$3:W22)","v":0},{"$f":"SUM(X$3:X22)","v":0},{"$f":"SUM(Y$3:Y22)","v":0},{"$f":"SUM(Z$3:Z22)","v":0},{"$f":"SUM(AA$3:AA22)","v":0},{"$f":"SUM(AB$3:AB22)","v":0}]
[3,"Sa 15:30",3,null,null,null,null,null,null,null,null,null,null,null,null,null,null,null,null,null,null,null,null,null,null,null,null,null,{"$f":"SUM(W$3:W23)","v":0},{"$f":"SUM(X$3:X23)","v":0},{"$f":"SUM(Y$3:Y23)","v":0},{"$f":"SUM(Z$3:Z23)","v":0},{"$f":"SUM(AA$3:AA23)","v":0},{"$f":"SUM(AB$3:AB23)","v":0},{"$f":"SUM(W$3:W23)","v":0},{"$f":"SUM(X$3:X23)","v":0},{"$f":"SUM(Y$3:Y23)","v":0},{"$f":"SUM(Z$3:Z23)","v":0},{"$f":"SUM(AA$3:AA23)","v":0},{"$f":"SUM(AB$3:AB23)","v":0}]
[3,"Sa 15:30",4,null,null,null,null,null,null,null,null,null,null,null,null,null,null,null,null,null,null,null,null,null,null,null,null,null,{"$f":"SUM(W$3:W24)","v":0},{"$f":"SUM(X$3:X24)","v":0},{"$f":"SUM(Y$3:Y24)","v":0},{"$f":"SUM(Z$3:Z24)","v":0},{"$f":"SUM(AA$3:AA24)","v":0},{"$f":"SUM(AB$3:AB24)","v":0},{"$f":"SUM(W$3:W24)","v":0},{"$f":"SUM(X$3:X24)","v":0},{"$f":"SUM(Y$3:Y24)","v":0},{"$f":"SUM(Z$3:Z24)","v":0},{"$f":"SUM(AA$3:AA24)","v":0},{"$f":"SUM(AB$3:AB24)","v":0}]
[3,"Sa 15:30",5,null,null,null,null,null,null,null,null,null,null,null,null,null,null,null,null,null,null,null,null,null,null,null,null,null,{"$f":"SUM(W$3:W25)","v":0},{"$f":"SUM(X$3:X25)","v":0},{"$f":"SUM(Y$3:Y25)","v":0},{"$f":"SUM(Z$3:Z25)","v":0},{"$f":"SUM(AA$3:AA25)","v":0},{"$f":"SUM(AB$3:AB25)","v":0},{"$f":"SUM(W$3:W25)","v":0},{"$f":"SUM(X$3:X25)","v":0},{"$f":"SUM(Y$3:Y25)","v":0},{"$f":"SUM(Z$3:Z25)","v":0},{"$f":"SUM(AA$3:AA25)","v":0},{"$f":"SUM(AB$3:AB25)","v":0}]
[3,"Sa 15:30",6,null,null,null,null,null,null,null,null,null,null,null,null,null,null,null,null,null,null,null,null,null,null,null,null,null,{"$f":"SUM(W$3:W26)","v":0},{"$f":"SUM(X$3:X26)","v":0},{"$f":"SUM(Y$3:Y26)","v":0},{"$f":"SUM(Z$3:Z26)","v":0},{"$f":"SUM(AA$3:AA26)","v":0},{"$f":"SUM(AB$3:AB26)","v":0},{"$f":"SUM(W$3:W26)","v":0},{"$f":"SUM(X$3:X26)","v":0},{"$f":"SUM(Y$3:Y26)","v":0},{"$f":"SUM(Z$3:Z26)","v":0},{"$f":"SUM(AA$3:AA26)","v":0},{"$f":"SUM(AB$3:AB26)","v":0}]
[3,"Sa 18:30",7,null,null,null,null,null,null,null,null,null,null,null,null,null,null,null,null,null,null,null,null,null,null,null,null,null,{"$f":"SUM(W$3:W27)","v":0},{"$f":"SUM(X$3:X27)","v":0},{"$f":"SUM(Y$3:Y27)","v":0},{"$f":"SUM(Z$3:Z27)","v":0},{"$f":"SUM(AA$3:AA27)","v":0},{"$f":"SUM(AB$3:AB27)","v":0},{"$f":"SUM(W$3:W27)","v":0},{"$f":"SUM(X$3:X27)","v":0},{"$f":"SUM(Y$3:Y27)","v":0},{"$f":"SUM(Z$3:Z27)","v":0},{"$f":"SUM(AA$3:AA27)","v":0},{"$f":"SUM(AB$3:AB27)","v":0}]
[3,"So 15:30",8,null,null,null,null,null,null,null,null,null,null,null,null,null,null,null,null,null,null,null,null,null,null,null,null,null,{"$f":"SUM(W$3:W28)","v":0},{"$f":"SUM(X$3:X28)","v":0},{"$f":"SUM(Y$3:Y28)","v":0},{"$f":"SUM(Z$3:Z28)","v":0},{"$f":"SUM(AA$3:AA28)","v":0},{"$f":"SUM(AB$3:AB28)","v":0},{"$f":"SUM(W$3:W28)","v":0},{"$f":"SUM(X$3:X28)","v":0},{"$f":"SUM(Y$3:Y28)","v":0},{"$f":"SUM(Z$3:Z28)","v":0},{"$f":"SUM(AA$3:AA28)","v":0},{"$f":"SUM(AB$3:AB28)","v":0}]
[3,"So 17:30",9,null,null,null,null,null,null,null,null,null,null,null,null,null,null,null,null,null,null,null,null,null,null,null,null,null,{"$f":"SUM(W$3:W29)","v":0},{"$f":"SUM(X$3:X29)","v":0},{"$f":"SUM(Y$3:Y29)","v":0},{"$f":"SUM(Z$3:Z29)","v":0},{"$f":"SUM(AA$3:AA29)","v":0},{"$f":"SUM(AB$3:AB29)","v":0},{"$f":"SUM(W$3:W29)","v":0},{"$f":"SUM(X$3:X29)","v":0},{"$f":"SUM(Y$3:Y29)","v":0},{"$f":"SUM(Z$3:Z29)","v":0},{"$f":"SUM(AA$3:AA29)","v":0},{"$f":"SUM(AB$3:AB29)","v":0}]
[4,"Fr 20:30",1,null,null,null,null,null,null,null,null,null,null,null,null,null,null,null,null,null,null,null,null,null,null,null,null,null,{"$f":"SUM(W$3:W30)","v":0},{"$f":"SUM(X$3:X30)","v":0},{"$f":"SUM(Y$3:Y30)","v":0},{"$f":"SUM(Z$3:Z30)","v":0},{"$f":"SUM(AA$3:AA30)","v":0},{"$f":"SUM(AB$3:AB30)","v":0},{"$f":"SUM(W$3:W30)","v":0},{"$f":"SUM(X$3:X30)","v":0},{"$f":"SUM(Y$3:Y30)","v":0},{"$f":"SUM(Z$3:Z30)","v":0},{"$f":"SUM(AA$3:AA30)","v":0},{"$f":"SUM(AB$3:AB30)","v":0}]
[4,"Sa 15:30",2,null,null,null,null,null,null,null,null,null,null,null,null,null,null,null,null,null,null,null,null,null,null,null,null,null,{"$f":"SUM(W$3:W31)","v":0},{"$f":"SUM(X$3:X31)","v":0},{"$f":"SUM(Y$3:Y31)","v":0},{"$f":"SUM(Z$3:Z31)","v":0},{"$f":"SUM(AA$3:AA31)","v":0},{"$f":"SUM(AB$3:AB31)","v":0},{"$f":"SUM(W$3:W31)","v":0},{"$f":"SUM(X$3:X31)","v":0},{"$f":"SUM(Y$3:Y31)","v":0},{"$f":"SUM(Z$3:Z31)","v":0},{"$f":"SUM(AA$3:AA31)","v":0},{"$f":"SUM(AB$3:AB31)","v":0}]
[4,"Sa 15:30",3,null,null,null,null,null,null,null,null,null,null,null,null,null,null,null,null,null,null,null,null,null,null,null,null,null,{"$f":"SUM(W$3:W32)","v":0},{"$f":"SUM(X$3:X32)","v":0},{"$f":"SUM(Y$3:Y32)","v":0},{"$f":"SUM(Z$3:Z32)","v":0},{"$f":"SUM(AA$3:AA32)","v":0},{"$f":"SUM(AB$3:AB32)","v":0},{"$f":"SUM(W$3:W32)","v":0},{"$f":"SUM(X$3:X32)","v":0},{"$f":"SUM(Y$3:Y32)","v":0},{"$f":"SUM(Z$3:Z32)","v":0},{"$f":"SUM(AA$3:AA32)","v":0},{"$f":"SUM(AB$3:AB32)","v":0}]
[4,"Sa 15:30",4,null,null,null,null,null,null,null,null,null,null,null,null,null,null,null,null,null,null,null,null,null,null,null,null,null,{"$f":"SUM(W$3:W33)","v":0},{"$f":"SUM(X$3:X33)","v":0},{"$f":"SUM(Y$3:Y33)","v":0},{"$f":"SUM(Z$3:Z33)","v":0},{"$f":"SUM(AA$3:AA33)","v":0},{"$f":"SUM(AB$3:AB33)","v":0},{"$f":"SUM(W$3:W33)","v":0},{"$f":"SUM(X$3:X33)","v":0},{"$f":"SUM(Y$3:Y33)","v":0},{"$f":"SUM(Z$3:Z33)","v":0},{"$f":"SUM(AA$3:AA33)","v":0},{"$f":"SUM(AB$3:AB33)","v":0}]
[4,"Sa 15:30",5,null,null,null,null,null,null,null,null,null,null,null,null,null,null,null,null,null,null,null,null,null,null,null,null,null,{"$f":"SUM(W$3:W34)","v":0},{"$f":"SUM(X$3:X34)","v":0},{"$f":"SUM(Y$3:Y34)","v":0},{"$f":"SUM(Z$3:Z34)","v":0},{"$f":"SUM(AA$3:AA34)","v":0},{"$f":"SUM(AB$3:AB34)","v":0},{"$f":"SUM(W$3:W34)","v":0},{"$f":"SUM(X$3:X34)","v":0},{"$f":"SUM(Y$3:Y34)","v":0},{"$f":"SUM(Z$3:Z34)","v":0},{"$f":"SUM(AA$3:AA34)","v":0},{"$f":"SUM(AB$3:AB34)","v":0}]
[4,"Sa 18:30",6,null,null,null,null,null,null,null,null,null,null,null,null,null,null,null,null,null,null,null,null,null,null,null,null,null,{"$f":"SUM(W$3:W35)","v":0},{"$f":"SUM(X$3:X35)","v":0},{"$f":"SUM(Y$3:Y35)","v":0},{"$f":"SUM(Z$3:Z35)","v":0},{"$f":"SUM(AA$3:AA35)","v":0},{"$f":"SUM(AB$3:AB35)","v":0},{"$f":"SUM(W$3:W35)","v":0},{"$f":"SUM(X$3:X35)","v":0},{"$f":"SUM(Y$3:Y35)","v":0},{"$f":"SUM(Z$3:Z35)","v":0},{"$f":"SUM(AA$3:AA35)","v":0},{"$f":"SUM(AB$3:AB35)","v":0}]
[4,"So 15:30",7,null,null,null,null,null,null,null,null,null,null,null,null,null,null,null,null,null,null,null,null,null,null,null,null,null,{"$f":"SUM(W$3:W36)","v":0},{"$f":"SUM(X$3:X36)","v":0},{"$f":"SUM(Y$3:Y36)","v":0},{"$f":"SUM(Z$3:Z36)","v":0},{"$f":"SUM(AA$3:AA36)","v":0},{"$f":"SUM(AB$3:AB36)","v":0},{"$f":"SUM(W$3:W36)","v":0},{"$f":"SUM(X$3:X36)","v":0},{"$f":"SUM(Y$3:Y36)","v":0},{"$f":"SUM(Z$3:Z36)","v":0},{"$f":"SUM(AA$3:AA36)","v":0},{"$f":"SUM(AB$3:AB36)","v":0}]
[4,"So 17:30",8,null,null,null,null,null,null,null,null,null,null,null,null,null,null,null,null,null,null,null,null,null,null,null,null,null,{"$f":"SUM(W$3:W37)","v":0},{"$f":"SUM(X$3:X37)","v":0},{"$f":"SUM(Y$3:Y37)","v":0},{"$f":"SUM(Z$3:Z37)","v":0},{"$f":"SUM(AA$3:AA37)","v":0},{"$f":"SUM(AB$3:AB37)","v":0},{"$f":"SUM(W$3:W37)","v":0},{"$f":"SUM(X$3:X37)","v":0},{"$f":"SUM(Y$3:Y37)","v":0},{"$f":"SUM(Z$3:Z37)","v":0},{"$f":"SUM(AA$3:AA37)","v":0},{"$f":"SUM(AB$3:AB37)","v":0}]
[4,"So 19:30",9,null,null,null,null,null,null,null,null,null,null,null,null,null,null,null,null,null,null,null,null,null,null,null,null,null,{"$f":"SUM(W$3:W38)","v":0},{"$f":"SUM(X$3:X38)","v":0},{"$f":"SUM(Y$3:Y38)","v":0},{"$f":"SUM(Z$3:Z38)","v":0},{"$f":"SUM(AA$3:AA38)","v":0},{"$f":"SUM(AB$3:AB38)","v":0},{"$f":"SUM(W$3:W38)","v":0},{"$f":"SUM(X$3:X38)","v":0},{"$f":"SUM(Y$3:Y38)","v":0},{"$f":"SUM(Z$3:Z38)","v":0},{"$f":"SUM(AA$3:AA38)","v":0},{"$f":"SUM(AB$3:AB38)","v":0}]
[5,"Fr 20:30",1,null,null,null,null,null,null,null,null,null,null,null,null,null,null,null,null,null,null,null,null,null,null,null,null,null,{"$f":"SUM(W$3:W39)","v":0},{"$f":"SUM(X$3:X39)","v":0},{"$f":"SUM(Y$3:Y39)","v":0},{"$f":"SUM(Z$3:Z39)","v":0},{"$f":"SUM(AA$3:AA39)","v":0},{"$f":"SUM(AB$3:AB39)","v":0},{"$f":"SUM(W$3:W39)","v":0},{"$f":"SUM(X$3:X39)","v":0},{"$f":"SUM(Y$3:Y39)","v":0},{"$f":"SUM(Z$3:Z39)","v":0},{"$f":"SUM(AA$3:AA39)","v":0},{"$f":"SUM(AB$3:AB39)","v":0}]
[5,"Sa 15:30",2,null,null,null,null,null,null,null,null,null,null,null,null,null,null,null,null,null,null,null,null,null,null,null,null,null,{"$f":"SUM(W$3:W40)","v":0},{"$f":"SUM(X$3:X40)","v":0},{"$f":"SUM(Y$3:Y40)","v":0},{"$f":"SUM(Z$3:Z40)","v":0},{"$f":"SUM(AA$3:AA40)","v":0},{"$f":"SUM(AB$3:AB40)","v":0},{"$f":"SUM(W$3:W40)","v":0},{"$f":"SUM(X$3:X40)","v":0},{"$f":"SUM(Y$3:Y40)","v":0},{"$f":"SUM(Z$3:Z40)","v":0},{"$f":"SUM(AA$3:AA40)","v":0},{"$f":"SUM(AB$3:AB40)","v":0}]
[5,"Sa 15:30",3,null,null,null,null,null,null,null,null,null,null,null,null,null,null,null,null,null,null,null,null,null,null,null,null,null,{"$f":"SUM(W$3:W41)","v":0},{"$f":"SUM(X$3:X41)","v":0},{"$f":"SUM(Y$3:Y41)","v":0},{"$f":"SUM(Z$3:Z41)","v":0},{"$f":"SUM(AA$3:AA41)","v":0},{"$f":"SUM(AB$3:AB41)","v":0},{"$f":"SUM(W$3:W41)","v":0},{"$f":"SUM(X$3:X41)","v":0},{"$f":"SUM(Y$3:Y41)","v":0},{"$f":"SUM(Z$3:Z41)","v":0},{"$f":"SUM(AA$3:AA41)","v":0},{"$f":"SUM(AB$3:AB41)","v":0}]
[5,"Sa 15:30",4,null,null,null,null,null,null,null,null,null,null,null,null,null,null,null,null,null,null,null,null,null,null,null,null,null,{"$f":"SUM(W$3:W42)","v":0},{"$f":"SUM(X$3:X42)","v":0},{"$f":"SUM(Y$3:Y42)","v":0},{"$f":"SUM(Z$3:Z42)","v":0},{"$f":"SUM(AA$3:AA42)","v":0},{"$f":"SUM(AB$3:AB42)","v":0},{"$f":"SUM(W$3:W42)","v":0},{"$f":"SUM(X$3:X42)","v":0},{"$f":"SUM(Y$3:Y42)","v":0},{"$f":"SUM(Z$3:Z42)","v":0},{"$f":"SUM(AA$3:AA42)","v":0},{"$f":"SUM(AB$3:AB42)","v":0}]
[5,"Sa 15:30",5,null,null,null,null,null,null,null,null,null,null,null,null,null,null,null,null,null,null,null,null,null,null,null,null,null,{"$f":"SUM(W$3:W43)","v":0},{"$f":"SUM(X$3:X43)","v":0},{"$f":"SUM(Y$3:Y43)","v":0},{"$f":"SUM(Z$3:Z43)","v":0},{"$f":"SUM(AA$3:AA43)","v":0},{"$f":"SUM(AB$3:AB43)","v":0},{"$f":"SUM(W$3:W43)","v":0},{"$f":"SUM(X$3:X43)","v":0},{"$f":"SUM(Y$3:Y43)","v":0},{"$f":"SUM(Z$3:Z43)","v":0},{"$f":"SUM(AA$3:AA43)","v":0},{"$f":"SUM(AB$3:AB43)","v":0}]
[5,"Sa 18:30",6,null,null,null,null,null,null,null,null,null,null,null,null,null,null,null,null,null,null,null,null,null,null,null,null,null,{"$f":"SUM(W$3:W44)","v":0},{"$f":"SUM(X$3:X44)","v":0},{"$f":"SUM(Y$3:Y44)","v":0},{"$f":"SUM(Z$3:Z44)","v":0},{"$f":"SUM(AA$3:AA44)","v":0},{"$f":"SUM(AB$3:AB44)","v":0},{"$f":"SUM(W$3:W44)","v":0},{"$f":"SUM(X$3:X44)","v":0},{"$f":"SUM(Y$3:Y44)","v":0},{"$f":"SUM(Z$3:Z44)","v":0},{"$f":"SUM(AA$3:AA44)","v":0},{"$f":"SUM(AB$3:AB44)","v":0}]
[5,"So 15:30",7,null,null,null,null,null,null,null,null,null,null,null,null,null,null,null,null,null,null,null,null,null,null,null,null,null,{"$f":"SUM(W$3:W45)","v":0},{"$f":"SUM(X$3:X45)","v":0},{"$f":"SUM(Y$3:Y45)","v":0},{"$f":"SUM(Z$3:Z45)","v":0},{"$f":"SUM(AA$3:AA45)","v":0},{"$f":"SUM(AB$3:AB45)","v":0},{"$f":"SUM(W$3:W45)","v":0},{"$f":"SUM(X$3:X45)","v":0},{"$f":"SUM(Y$3:Y45)","v":0},{"$f":"SUM(Z$3:Z45)","v":0},{"$f":"SUM(AA$3:AA45)","v":0},{"$f":"SUM(AB$3:AB45)","v":0}]
[5,"So 17:30",8,null,null,null,null,null,null,null,null,null,null,null,null,null,null,null,null,null,null,null,null,null,null,null,null,null,{"$f":"SUM(W$3:W46)","v":0},{"$f":"SUM(X$3:X46)","v":0},{"$f":"SUM(Y$3:Y46)","v":0},{"$f":"SUM(Z$3:Z46)","v":0},{"$f":"SUM(AA$3:AA46)","v":0},{"$f":"SUM(AB$3:AB46)","v":0},{"$f":"SUM(W$3:W46)","v":0},{"$f":"SUM(X$3:X46)","v":0},{"$f":"SUM(Y$3:Y46)","v":0},{"$f":"SUM(Z$3:Z46)","v":0},{"$f":"SUM(AA$3:AA46)","v":0},{"$f":"SUM(AB$3:AB46)","v":0}]
[5,"So 19:30",9,null,null,null,null,null,null,null,null,null,null,null,null,null,null,null,null,null,null,null,null,null,null,null,null,null,{"$f":"SUM(W$3:W47)","v":0},{"$f":"SUM(X$3:X47)","v":0},{"$f":"SUM(Y$3:Y47)","v":0},{"$f":"SUM(Z$3:Z47)","v":0},{"$f":"SUM(AA$3:AA47)","v":0},{"$f":"SUM(AB$3:AB47)","v":0},{"$f":"SUM(W$3:W47)","v":0},{"$f":"SUM(X$3:X47)","v":0},{"$f":"SUM(Y$3:Y47)","v":0},{"$f":"SUM(Z$3:Z47)","v":0},{"$f":"SUM(AA$3:AA47)","v":0},{"$f":"SUM(AB$3:AB47)","v":0}]
[6,"Fr 20:30",1,null,null,null,null,null,null,null,null,null,null,null,null,null,null,null,null,null,null,null,null,null,null,null,null,null,{"$f":"SUM(W$3:W48)","v":0},{"$f":"SUM(X$3:X48)","v":0},{"$f":"SUM(Y$3:Y48)","v":0},{"$f":"SUM(Z$3:Z48)","v":0},{"$f":"SUM(AA$3:AA48)","v":0},{"$f":"SUM(AB$3:AB48)","v":0},{"$f":"SUM(W$3:W48)","v":0},{"$f":"SUM(X$3:X48)","v":0},{"$f":"SUM(Y$3:Y48)","v":0},{"$f":"SUM(Z$3:Z48)","v":0},{"$f":"SUM(AA$3:AA48)","v":0},{"$f":"SUM(AB$3:AB48)","v":0}]
[6,"Sa 15:30",2,null,null,null,null,null,null,null,null,null,null,null,null,null,null,null,null,null,null,null,null,null,null,null,null,null,{"$f":"SUM(W$3:W49)","v":0},{"$f":"SUM(X$3:X49)","v":0},{"$f":"SUM(Y$3:Y49)","v":0},{"$f":"SUM(Z$3:Z49)","v":0},{"$f":"SUM(AA$3:AA49)","v":0},{"$f":"SUM(AB$3:AB49)","v":0},{"$f":"SUM(W$3:W49)","v":0},{"$f":"SUM(X$3:X49)","v":0},{"$f":"SUM(Y$3:Y49)","v":0},{"$f":"SUM(Z$3:Z49)","v":0},{"$f":"SUM(AA$3:AA49)","v":0},{"$f":"SUM(AB$3:AB49)","v":0}]
[6,"Sa 15:30",3,null,null,null,null,null,null,null,null,null,null,null,null,null,null,null,null,null,null,null,null,null,null,null,null,null,{"$f":"SUM(W$3:W50)","v":0},{"$f":"SUM(X$3:X50)","v":0},{"$f":"SUM(Y$3:Y50)","v":0},{"$f":"SUM(Z$3:Z50)","v":0},{"$f":"SUM(AA$3:AA50)","v":0},{"$f":"SUM(AB$3:AB50)","v":0},{"$f":"SUM(W$3:W50)","v":0},{"$f":"SUM(X$3:X50)","v":0},{"$f":"SUM(Y$3:Y50)","v":0},{"$f":"SUM(Z$3:Z50)","v":0},{"$f":"SUM(AA$3:AA50)","v":0},{"$f":"SUM(AB$3:AB50)","v":0}]
[6,"Sa 15:30",4,null,null,null,null,null,null,null,null,null,null,null,null,null,null,null,null,null,null,null,null,null,null,null,null,null,{"$f":"SUM(W$3:W51)","v":0},{"$f":"SUM(X$3:X51)","v":0},{"$f":"SUM(Y$3:Y51)","v":0},{"$f":"SUM(Z$3:Z51)","v":0},{"$f":"SUM(AA$3:AA51)","v":0},{"$f":"SUM(AB$3:AB51)","v":0},{"$f":"SUM(W$3:W51)","v":0},{"$f":"SUM(X$3:X51)","v":0},{"$f":"SUM(Y$3:Y51)","v":0},{"$f":"SUM(Z$3:Z51)","v":0},{"$f":"SUM(AA$3:AA51)","v":0},{"$f":"SUM(AB$3:AB51)","v":0}]
[6,"Sa 15:30",5,null,null,null,null,null,null,null,null,null,null,null,null,null,null,null,null,null,null,null,null,null,null,null,null,null,{"$f":"SUM(W$3:W52)","v":0},{"$f":"SUM(X$3:X52)","v":0},{"$f":"SUM(Y$3:Y52)","v":0},{"$f":"SUM(Z$3:Z52)","v":0},{"$f":"SUM(AA$3:AA52)","v":0},{"$f":"SUM(AB$3:AB52)","v":0},{"$f":"SUM(W$3:W52)","v":0},{"$f":"SUM(X$3:X52)","v":0},{"$f":"SUM(Y$3:Y52)","v":0},{"$f":"SUM(Z$3:Z52)","v":0},{"$f":"SUM(AA$3:AA52)","v":0},{"$f":"SUM(AB$3:AB52)","v":0}]
[6,"Sa 18:30",6,null,null,null,null,null,null,null,null,null,null,null,null,null,null,null,null,null,null,null,null,null,null,null,null,null,{"$f":"SUM(W$3:W53)","v":0},{"$f":"SUM(X$3:X53)","v":0},{"$f":"SUM(Y$3:Y53)","v":0},{"$f":"SUM(Z$3:Z53)","v":0},{"$f":"SUM(AA$3:AA53)","v":0},{"$f":"SUM(AB$3:AB53)","v":0},{"$f":"SUM(W$3:W53)","v":0},{"$f":"SUM(X$3:X53)","v":0},{"$f":"SUM(Y$3:Y53)","v":0},{"$f":"SUM(Z$3:Z53)","v":0},{"$f":"SUM(AA$3:AA53)","v":0},{"$f":"SUM(AB$3:AB53)","v":0}]
[6,"So 15:30",7,null,null,null,null,null,null,null,null,null,null,null,null,null,null,null,null,null,null,null,null,null,null,null,null,null,{"$f":"SUM(W$3:W54)","v":0},{"$f":"SUM(X$3:X54)","v":0},{"$f":"SUM(Y$3:Y54)","v":0},{"$f":"SUM(Z$3:Z54)","v":0},{"$f":"SUM(AA$3:AA54)","v":0},{"$f":"SUM(AB$3:AB54)","v":0},{"$f":"SUM(W$3:W54)","v":0},{"$f":"SUM(X$3:X54)","v":0},{"$f":"SUM(Y$3:Y54)","v":0},{"$f":"SUM(Z$3:Z54)","v":0},{"$f":"SUM(AA$3:AA54)","v":0},{"$f":"SUM(AB$3:AB54)","v":0}]
[6,"So 17:30",8,null,null,null,null,null,null,null,null,null,null,null,null,null,null,null,null,null,null,null,null,null,null,null,null,null,{"$f":"SUM(W$3:W55)","v":0},{"$f":"SUM(X$3:X55)","v":0},{"$f":"SUM(Y$3:Y55)","v":0},{"$f":"SUM(Z$3:Z55)","v":0},{"$f":"SUM(AA$3:AA55)","v":0},{"$f":"SUM(AB$3:AB55)","v":0},{"$f":"SUM(W$3:W55)","v":0},{"$f":"SUM(X$3:X55)","v":0},{"$f":"SUM(Y$3:Y55)","v":0},{"$f":"SUM(Z$3:Z55)","v":0},{"$f":"SUM(AA$3:AA55)","v":0},{"$f":"SUM(AB$3:AB55)","v":0}]
[6,"So 19:30",9,null,null,null,null,null,null,null,null,null,null,null,null,null,null,null,null,null,null,null,null,null,null,null,null,null,{"$f":"SUM(W$3:W56)","v":0},{"$f":"SUM(X$3:X56)","v":0},{"$f":"SUM(Y$3:Y56)","v":0},{"$f":"SUM(Z$3:Z56)","v":0},{"$f":"SUM(AA$3:AA56)","v":0},{"$f":"SUM(AB$3:AB56)","v":0},{"$f":"SUM(W$3:W56)","v":0},{"$f":"SUM(X$3:X56)","v":0},{"$f":"SUM(Y$3:Y56)","v":0},{"$f":"SUM(Z$3:Z56)","v":0},{"$f":"SUM(AA$3:AA56)","v":0},{"$f":"SUM(AB$3:AB56)","v":0}]
[7,"Fr 20:30",1,null,null,null,null,null,null,null,null,null,null,null,null,null,null,null,null,null,null,null,null,null,null,null,null,null,{"$f":"SUM(W$3:W57)","v":0},{"$f":"SUM(X$3:X57)","v":0},{"$f":"SUM(Y$3:Y57)","v":0},{"$f":"SUM(Z$3:Z57)","v":0},{"$f":"SUM(AA$3:AA57)","v":0},{"$f":"SUM(AB$3:AB57)","v":0},{"$f":"SUM(W$3:W57)","v":0},{"$f":"SUM(X$3:X57)","v":0},{"$f":"SUM(Y$3:Y57)","v":0},{"$f":"SUM(Z$3:Z57)","v":0},{"$f":"SUM(AA$3:AA57)","v":0},{"$f":"SUM(AB$3:AB57)","v":0}]
[7,"Sa 15:30",2,null,null,null,null,null,null,null,null,null,null,null,null,null,null,null,null,null,null,null,null,null,null,null,null,null,{"$f":"SUM(W$3:W58)","v":0},{"$f":"SUM(X$3:X58)","v":0},{"$f":"SUM(Y$3:Y58)","v":0},{"$f":"SUM(Z$3:Z58)","v":0},{"$f":"SUM(AA$3:AA58)","v":0},{"$f":"SUM(AB$3:AB58)","v":0},{"$f":"SUM(W$3:W58)","v":0},{"$f":"SUM(X$3:X58)","v":0},{"$f":"SUM(Y$3:Y58)","v":0},{"$f":"SUM(Z$3:Z58)","v":0},{"$f":"SUM(AA$3:AA58)","v":0},{"$f":"SUM(AB$3:AB58)","v":0}]
[7,"Sa 15:30",3,null,null,null,null,null,null,null,null,null,null,null,null,null,null,null,null,null,null,null,null,null,null,null,null,null,{"$f":"SUM(W$3:W59)","v":0},{"$f":"SUM(X$3:X59)","v":0},{"$f":"SUM(Y$3:Y59)","v":0},{"$f":"SUM(Z$3:Z59)","v":0},{"$f":"SUM(AA$3:AA59)","v":0},{"$f":"SUM(AB$3:AB59)","v":0},{"$f":"SUM(W$3:W59)","v":0},{"$f":"SUM(X$3:X59)","v":0},{"$f":"SUM(Y$3:Y59)","v":0},{"$f":"SUM(Z$3:Z59)","v":0},{"$f":"SUM(AA$3:AA59)","v":0},{"$f":"SUM(AB$3:AB59)","v":0}]
[7,"Sa 15:30",4,null,null,null,null,null,null,null,null,null,null,null,null,null,null,null,null,null,null,null,null,null,null,null,null,null,{"$f":"SUM(W$3:W60)","v":0},{"$f":"SUM(X$3:X60)","v":0},{"$f":"SUM(Y$3:Y60)","v":0},{"$f":"SUM(Z$3:Z60)","v":0},{"$f":"SUM(AA$3:AA60)","v":0},{"$f":"SUM(AB$3:AB60)","v":0},{"$f":"SUM(W$3:W60)","v":0},{"$f":"SUM(X$3:X60)","v":0},{"$f":"SUM(Y$3:Y60)","v":0},{"$f":"SUM(Z$3:Z60)","v":0},{"$f":"SUM(AA$3:AA60)","v":0},{"$f":"SUM(AB$3:AB60)","v":0}]
[7,"Sa 15:30",5,null,null,null,null,null,null,null,null,null,null,null,null,null,null,null,null,null,null,null,null,null,null,null,null,null,{"$f":"SUM(W$3:W61)","v":0},{"$f":"SUM(X$3:X61)","v":0},{"$f":"SUM(Y$3:Y61)","v":0},{"$f":"SUM(Z$3:Z61)","v":0},{"$f":"SUM(AA$3:AA61)","v":0},{"$f":"SUM(AB$3:AB61)","v":0},{"$f":"SUM(W$3:W61)","v":0},{"$f":"SUM(X$3:X61)","v":0},{"$f":"SUM(Y$3:Y61)","v":0},{"$f":"SUM(Z$3:Z61)","v":0},{"$f":"SUM(AA$3:AA61)","v":0},{"$f":"SUM(AB$3:AB61)","v":0}]
[7,"Sa 15:30",6,null,null,null,null,null,null,null,null,null,null,null,null,null,null,null,null,null,null,null,null,null,null,null,null,null,{"$f":"SUM(W$3:W62)","v":0},{"$f":"SUM(X$3:X62)","v":0},{"$f":"SUM(Y$3:Y62)","v":0},{"$f":"SUM(Z$3:Z62)","v":0},{"$f":"SUM(AA$3:AA62)","v":0},{"$f":"SUM(AB$3:AB62)","v":0},{"$f":"SUM(W$3:W62)","v":0},{"$f":"SUM(X$3:X62)","v":0},{"$f":"SUM(Y$3:Y62)","v":0},{"$f":"SUM(Z$3:Z62)","v":0},{"$f":"SUM(AA$3:AA62)","v":0},{"$f":"SUM(AB$3:AB62)","v":0}]
[7,"Sa 18:30",7,null,null,null,null,null,null,null,null,null,null,null,null,null,null,null,null,null,null,null,null,null,null,null,null,null,{"$f":"SUM(W$3:W63)","v":0},{"$f":"SUM(X$3:X63)","v":0},{"$f":"SUM(Y$3:Y63)","v":0},{"$f":"SUM(Z$3:Z63)","v":0},{"$f":"SUM(AA$3:AA63)","v":0},{"$f":"SUM(AB$3:AB63)","v":0},{"$f":"SUM(W$3:W63)","v":0},{"$f":"SUM(X$3:X63)","v":0},{"$f":"SUM(Y$3:Y63)","v":0},{"$f":"SUM(Z$3:Z63)","v":0},{"$f":"SUM(AA$3:AA63)","v":0},{"$f":"SUM(AB$3:AB63)","v":0}]
[7,"So 15:30",8,null,null,null,null,null,null,null,null,null,null,null,null,null,null,null,null,null,null,null,null,null,null,null,null,null,{"$f":"SUM(W$3:W64)","v":0},{"$f":"SUM(X$3:X64)","v":0},{"$f":"SUM(Y$3:Y64)","v":0},{"$f":"SUM(Z$3:Z64)","v":0},{"$f":"SUM(AA$3:AA64)","v":0},{"$f":"SUM(AB$3:AB64)","v":0},{"$f":"SUM(W$3:W64)","v":0},{"$f":"SUM(X$3:X64)","v":0},{"$f":"SUM(Y$3:Y64)","v":0},{"$f":"SUM(Z$3:Z64)","v":0},{"$f":"SUM(AA$3:AA64)","v":0},{"$f":"SUM(AB$3:AB64)","v":0}]
[7,"So 17:30",9,null,null,null,null,null,null,null,null,null,null,null,null,null,null,null,null,null,null,null,null,null,null,null,null,null,{"$f":"SUM(W$3:W65)","v":0},{"$f":"SUM(X$3:X65)","v":0},{"$f":"SUM(Y$3:Y65)","v":0},{"$f":"SUM(Z$3:Z65)","v":0},{"$f":"SUM(AA$3:AA65)","v":0},{"$f":"SUM(AB$3:AB65)","v":0},{"$f":"SUM(W$3:W65)","v":0},{"$f":"SUM(X$3:X65)","v":0},{"$f":"SUM(Y$3:Y65)","v":0},{"$f":"SUM(Z$3:Z65)","v":0},{"$f":"SUM(AA$3:AA65)","v":0},{"$f":"SUM(AB$3:AB65)","v":0}]
[8,"Fr 20:30",1,null,null,null,null,null,null,null,null,null,null,null,null,null,null,null,null,null,null,null,null,null,null,null,null,null,{"$f":"SUM(W$3:W66)","v":0},{"$f":"SUM(X$3:X66)","v":0},{"$f":"SUM(Y$3:Y66)","v":0},{"$f":"SUM(Z$3:Z66)","v":0},{"$f":"SUM(AA$3:AA66)","v":0},{"$f":"SUM(AB$3:AB66)","v":0},{"$f":"SUM(W$3:W66)","v":0},{"$f":"SUM(X$3:X66)","v":0},{"$f":"SUM(Y$3:Y66)","v":0},{"$f":"SUM(Z$3:Z66)","v":0},{"$f":"SUM(AA$3:AA66)","v":0},{"$f":"SUM(AB$3:AB66)","v":0}]
[8,"Sa 15:30",2,null,null,null,null,null,null,null,null,null,null,null,null,null,null,null,null,null,null,null,null,null,null,null,null,null,{"$f":"SUM(W$3:W67)","v":0},{"$f":"SUM(X$3:X67)","v":0},{"$f":"SUM(Y$3:Y67)","v":0},{"$f":"SUM(Z$3:Z67)","v":0},{"$f":"SUM(AA$3:AA67)","v":0},{"$f":"SUM(AB$3:AB67)","v":0},{"$f":"SUM(W$3:W67)","v":0},{"$f":"SUM(X$3:X67)","v":0},{"$f":"SUM(Y$3:Y67)","v":0},{"$f":"SUM(Z$3:Z67)","v":0},{"$f":"SUM(AA$3:AA67)","v":0},{"$f":"SUM(AB$3:AB67)","v":0}]
[8,"Sa 15:30",3,null,null,null,null,null,null,null,null,null,null,null,null,null,null,null,null,null,null,null,null,null,null,null,null,null,{"$f":"SUM(W$3:W68)","v":0},{"$f":"SUM(X$3:X68)","v":0},{"$f":"SUM(Y$3:Y68)","v":0},{"$f":"SUM(Z$3:Z68)","v":0},{"$f":"SUM(AA$3:AA68)","v":0},{"$f":"SUM(AB$3:AB68)","v":0},{"$f":"SUM(W$3:W68)","v":0},{"$f":"SUM(X$3:X68)","v":0},{"$f":"SUM(Y$3:Y68)","v":0},{"$f":"SUM(Z$3:Z68)","v":0},{"$f":"SUM(AA$3:AA68)","v":0},{"$f":"SUM(AB$3:AB68)","v":0}]
[8,"Sa 15:30",4,null,null,null,null,null,null,null,null,null,null,null,null,null,null,null,null,null,null,null,null,null,null,null,null,null,{"$f":"SUM(W$3:W69)","v":0},{"$f":"SUM(X$3:X69)","v":0},{"$f":"SUM(Y$3:Y69)","v":0},{"$f":"SUM(Z$3:Z69)","v":0},{"$f":"SUM(AA$3:AA69)","v":0},{"$f":"SUM(AB$3:AB69)","v":0},{"$f":"SUM(W$3:W69)","v":0},{"$f":"SUM(X$3:X69)","v":0},{"$f":"SUM(Y$3:Y69)","v":0},{"$f":"SUM(Z$3:Z69)","v":0},{"$f":"SUM(AA$3:AA69)","v":0},{"$f":"SUM(AB$3:AB69)","v":0}]
[8,"Sa 15:30",5,null,null,null,null,null,null,null,null,null,null,null,null,null,null,null,null,null,null,null,null,null,null,null,null,null,{"$f":"SUM(W$3:W70)","v":0},{"$f":"SUM(X$3:X70)","v":0},{"$f":"SUM(Y$3:Y70)","v":0},{"$f":"SUM(Z$3:Z70)","v":0},{"$f":"SUM(AA$3:AA70)","v":0},{"$f":"SUM(AB$3:AB70)","v":0},{"$f":"SUM(W$3:W70)","v":0},{"$f":"SUM(X$3:X70)","v":0},{"$f":"SUM(Y$3:Y70)","v":0},{"$f":"SUM(Z$3:Z70)","v":0},{"$f":"SUM(AA$3:AA70)","v":0},{"$f":"SUM(AB$3:AB70)","v":0}]
[8,"Sa 15:30",6,null,null,null,null,null,null,null,null,null,null,null,null,null,null,null,null,null,null,null,null,null,null,null,null,null,{"$f":"SUM(W$3:W71)","v":0},{"$f":"SUM(X$3:X71)","v":0},{"$f":"SUM(Y$3:Y71)","v":0},{"$f":"SUM(Z$3:Z71)","v":0},{"$f":"SUM(AA$3:AA71)","v":0},{"$f":"SUM(AB$3:AB71)","v":0},{"$f":"SUM(W$3:W71)","v":0},{"$f":"SUM(X$3:X71)","v":0},{"$f":"SUM(Y$3:Y71)","v":0},{"$f":"SUM(Z$3:Z71)","v":0},{"$f":"SUM(AA$3:AA71)","v":0},{"$f":"SUM(AB$3:AB71)","v":0}]
[8,"Sa 18:30",7,null,null,null,null,null,null,null,null,null,null,null,null,null,null,null,null,null,null,null,null,null,null,null,null,null,{"$f":"SUM(W$3:W72)","v":0},{"$f":"SUM(X$3:X72)","v":0},{"$f":"SUM(Y$3:Y72)","v":0},{"$f":"SUM(Z$3:Z72)","v":0},{"$f":"SUM(AA$3:AA72)","v":0},{"$f":"SUM(AB$3:AB72)","v":0},{"$f":"SUM(W$3:W72)","v":0},{"$f":"SUM(X$3:X72)","v":0},{"$f":"SUM(Y$3:Y72)","v":0},{"$f":"SUM(Z$3:Z72)","v":0},{"$f":"SUM(AA$3:AA72)","v":0},{"$f":"SUM(AB$3:AB72)","v":0}]
[8,"So 15:30",8,null,null,null,null,null,null,null,null,null,null,null,null,null,null,null,null,null,null,null,null,null,null,null,null,null,{"$f":"SUM(W$3:W73)","v":0},{"$f":"SUM(X$3:X73)","v":0},{"$f":"SUM(Y$3:Y73)","v":0},{"$f":"SUM(Z$3:Z73)","v":0},{"$f":"SUM(AA$3:AA73)","v":0},{"$f":"SUM(AB$3:AB73)","v":0},{"$f":"SUM(W$3:W73)","v":0},{"$f":"SUM(X$3:X73)","v":0},{"$f":"SUM(Y$3:Y73)","v":0},{"$f":"SUM(Z$3:Z73)","v":0},{"$f":"SUM(AA$3:AA73)","v":0},{"$f":"SUM(AB$3:AB73)","v":0}]
[8,"So 17:30",9,null,null,null,null,null,null,null,null,null,null,null,null,null,null,null,null,null,null,null,null,null,null,null,null,null,{"$f":"SUM(W$3:W74)","v":0},{"$f":"SUM(X$3:X74)","v":0},{"$f":"SUM(Y$3:Y74)","v":0},{"$f":"SUM(Z$3:Z74)","v":0},{"$f":"SUM(AA$3:AA74)","v":0},{"$f":"SUM(AB$3:AB74)","v":0},{"$f":"SUM(W$3:W74)","v":0},{"$f":"SUM(X$3:X74)","v":0},{"$f":"SUM(Y$3:Y74)","v":0},{"$f":"SUM(Z$3:Z74)","v":0},{"$f":"SUM(AA$3:AA74)","v":0},{"$f":"SUM(AB$3:AB74)","v":0}]
[9,"Fr 20:30",1,null,null,null,null,null,null,null,null,null,null,null,null,null,null,null,null,null,null,null,null,null,null,null,null,null,{"$f":"SUM(W$3:W75)","v":0},{"$f":"SUM(X$3:X75)","v":0},{"$f":"SUM(Y$3:Y75)","v":0},{"$f":"SUM(Z$3:Z75)","v":0},{"$f":"SUM(AA$3:AA75)","v":0},{"$f":"SUM(AB$3:AB75)","v":0},{"$f":"SUM(W$3:W75)","v":0},{"$f":"SUM(X$3:X75)","v":0},{"$f":"SUM(Y$3:Y75)","v":0},{"$f":"SUM(Z$3:Z75)","v":0},{"$f":"SUM(AA$3:AA75)","v":0},{"$f":"SUM(AB$3:AB75)","v":0}]
[9,"Sa 15:30",2,null,null,null,null,null,null,null,null,null,null,null,null,null,null,null,null,null,null,null,null,null,null,null,null,null,{"$f":"SUM(W$3:W76)","v":0},{"$f":"SUM(X$3:X76)","v":0},{"$f":"SUM(Y$3:Y76)","v":0},{"$f":"SUM(Z$3:Z76)","v":0},{"$f":"SUM(AA$3:AA76)","v":0},{"$f":"SUM(AB$3:AB76)","v":0},{"$f":"SUM(W$3:W76)","v":0},{"$f":"SUM(X$3:X76)","v":0},{"$f":"SUM(Y$3:Y76)","v":0},{"$f":"SUM(Z$3:Z76)","v":0},{"$f":"SUM(AA$3:AA76)","v":0},{"$f":"SUM(AB$3:AB76)","v":0}]
[9,"Sa 15:30",3,null,null,null,null,null,null,null,null,null,null,null,null,null,null,null,null,null,null,null,null,null,null,null,null,null,{"$f":"SUM(W$3:W77)","v":0},{"$f":"SUM(X$3:X77)","v":0},{"$f":"SUM(Y$3:Y77)","v":0},{"$f":"SUM(Z$3:Z77)","v":0},{"$f":"SUM(AA$3:AA77)","v":0},{"$f":"SUM(AB$3:AB77)","v":0},{"$f":"SUM(W$3:W77)","v":0},{"$f":"SUM(X$3:X77)","v":0},{"$f":"SUM(Y$3:Y77)","v":0},{"$f":"SUM(Z$3:Z77)","v":0},{"$f":"SUM(AA$3:AA77)","v":0},{"$f":"SUM(AB$3:AB77)","v":0}]
[9,"Sa 15:30",4,null,null,null,null,null,null,null,null,null,null,null,null,null,null,null,null,null,null,null,null,null,null,null,null,null,{"$f":"SUM(W$3:W78)","v":0},{"$f":"SUM(X$3:X78)","v":0},{"$f":"SUM(Y$3:Y78)","v":0},{"$f":"SUM(Z$3:Z78)","v":0},{"$f":"SUM(AA$3:AA78)","v":0},{"$f":"SUM(AB$3:AB78)","v":0},{"$f":"SUM(W$3:W78)","v":0},{"$f":"SUM(X$3:X78)","v":0},{"$f":"SUM(Y$3:Y78)","v":0},{"$f":"SUM(Z$3:Z78)","v":0},{"$f":"SUM(AA$3:AA78)","v":0},{"$f":"SUM(AB$3:AB78)","v":0}]
[9,"Sa 15:30",5,null,null,null,null,null,null,null,null,null,null,null,null,null,null,null,null,null,null,null,null,null,null,null,null,null,{"$f":"SUM(W$3:W79)","v":0},{"$f":"SUM(X$3:X79)","v":0},{"$f":"SUM(Y$3:Y79)","v":0},{"$f":"SUM(Z$3:Z79)","v":0},{"$f":"SUM(AA$3:AA79)","v":0},{"$f":"SUM(AB$3:AB79)","v":0},{"$f":"SUM(W$3:W79)","v":0},{"$f":"SUM(X$3:X79)","v":0},{"$f":"SUM(Y$3:Y79)","v":0},{"$f":"SUM(Z$3:Z79)","v":0},{"$f":"SUM(AA$3:AA79)","v":0},{"$f":"SUM(AB$3:AB79)","v":0}]
[9,"Sa 15:30",6,null,null,null,null,null,null,null,null,null,null,null,null,null,null,null,null,null,null,null,null,null,null,null,null,null,{"$f":"SUM(W$3:W80)","v":0},{"$f":"SUM(X$3:X80)","v":0},{"$f":"SUM(Y$3:Y80)","v":0},{"$f":"SUM(Z$3:Z80)","v":0},{"$f":"SUM(AA$3:AA80)","v":0},{"$f":"SUM(AB$3:AB80)","v":0},{"$f":"SUM(W$3:W80)","v":0},{"$f":"SUM(X$3:X80)","v":0},{"$f":"SUM(Y$3:Y80)","v":0},{"$f":"SUM(Z$3:Z80)","v":0},{"$f":"SUM(AA$3:AA80)","v":0},{"$f":"SUM(AB$3:AB80)","v":0}]
[9,"Sa 18:30",7,null,null,null,null,null,null,null,null,null,null,null,null,null,null,null,null,null,null,null,null,null,null,null,null,null,{"$f":"SUM(W$3:W81)","v":0},{"$f":"SUM(X$3:X81)","v":0},{"$f":"SUM(Y$3:Y81)","v":0},{"$f":"SUM(Z$3:Z81)","v":0},{"$f":"SUM(AA$3:AA81)","v":0},{"$f":"SUM(AB$3:AB81)","v":0},{"$f":"SUM(W$3:W81)","v":0},{"$f":"SUM(X$3:X81)","v":0},{"$f":"SUM(Y$3:Y81)","v":0},{"$f":"SUM(Z$3:Z81)","v":0},{"$f":"SUM(AA$3:AA81)","v":0},{"$f":"SUM(AB$3:AB81)","v":0}]
[9,"So 15:30",8,null,null,null,null,null,null,null,null,null,null,null,null,null,null,null,null,null,null,null,null,null,null,null,null,null,{"$f":"SUM(W$3:W82)","v":0},{"$f":"SUM(X$3:X82)","v":0},{"$f":"SUM(Y$3:Y82)","v":0},{"$f":"SUM(Z$3:Z82)","v":0},{"$f":"SUM(AA$3:AA82)","v":0},{"$f":"SUM(AB$3:AB82)","v":0},{"$f":"SUM(W$3:W82)","v":0},{"$f":"SUM(X$3:X82)","v":0},{"$f":"SUM(Y$3:Y82)","v":0},{"$f":"SUM(Z$3:Z82)","v":0},{"$f":"SUM(AA$3:AA82)","v":0},{"$f":"SUM(AB$3:AB82)","v":0}]
[9,"So 17:30",9,null,null,null,null,null,null,null,null,null,null,null,null,null,null,null,null,null,null,null,null,null,null,null,null,null,{"$f":"SUM(W$3:W83)","v":0},{"$f":"SUM(X$3:X83)","v":0},{"$f":"SUM(Y$3:Y83)","v":0},{"$f":"SUM(Z$3:Z83)","v":0},{"$f":"SUM(AA$3:AA83)","v":0},{"$f":"SUM(AB$3:AB83)","v":0},{"$f":"SUM(W$3:W83)","v":0},{"$f":"SUM(X$3:X83)","v":0},{"$f":"SUM(Y$3:Y83)","v":0},{"$f":"SUM(Z$3:Z83)","v":0},{"$f":"SUM(AA$3:AA83)","v":0},{"$f":"SUM(AB$3:AB83)","v":0}]
[10,"Fr 20:30",1,null,null,null,null,null,null,null,null,null,null,null,null,null,null,null,null,null,null,null,null,null,null,null,null,null,{"$f":"SUM(W$3:W84)","v":0},{"$f":"SUM(X$3:X84)","v":0},{"$f":"SUM(Y$3:Y84)","v":0},{"$f":"SUM(Z$3:Z84)","v":0},{"$f":"SUM(AA$3:AA84)","v":0},{"$f":"SUM(AB$3:AB84)","v":0},{"$f":"SUM(W$3:W84)","v":0},{"$f":"SUM(X$3:X84)","v":0},{"$f":"SUM(Y$3:Y84)","v":0},{"$f":"SUM(Z$3:Z84)","v":0},{"$f":"SUM(AA$3:AA84)","v":0},{"$f":"SUM(AB$3:AB84)","v":0}]
[10,"Sa 15:30",2,null,null,null,null,null,null,null,null,null,null,null,null,null,null,null,null,null,null,null,null,null,null,null,null,null,{"$f":"SUM(W$3:W85)","v":0},{"$f":"SUM(X$3:X85)","v":0},{"$f":"SUM(Y$3:Y85)","v":0},{"$f":"SUM(Z$3:Z85)","v":0},{"$f":"SUM(AA$3:AA85)","v":0},{"$f":"SUM(AB$3:AB85)","v":0},{"$f":"SUM(W$3:W85)","v":0},{"$f":"SUM(X$3:X85)","v":0},{"$f":"SUM(Y$3:Y85)","v":0},{"$f":"SUM(Z$3:Z85)","v":0},{"$f":"SUM(AA$3:AA85)","v":0},{"$f":"SUM(AB$3:AB85)","v":0}]
[10,"Sa 15:30",3,null,null,null,null,null,null,null,null,null,null,null,null,null,null,null,null,null,null,null,null,null,null,null,null,null,{"$f":"SUM(W$3:W86)","v":0},{"$f":"SUM(X$3:X86)","v":0},{"$f":"SUM(Y$3:Y86)","v":0},{"$f":"SUM(Z$3:Z86)","v":0},{"$f":"SUM(AA$3:AA86)","v":0},{"$f":"SUM(AB$3:AB86)","v":0},{"$f":"SUM(W$3:W86)","v":0},{"$f":"SUM(X$3:X86)","v":0},{"$f":"SUM(Y$3:Y86)","v":0},{"$f":"SUM(Z$3:Z86)","v":0},{"$f":"SUM(AA$3:AA86)","v":0},{"$f":"SUM(AB$3:AB86)","v":0}]
[10,"Sa 15:30",4,null,null,null,null,null,null,null,null,null,null,null,null,null,null,null,null,null,null,null,null,null,null,null,null,null,{"$f":"SUM(W$3:W87)","v":0},{"$f":"SUM(X$3:X87)","v":0},{"$f":"SUM(Y$3:Y87)","v":0},{"$f":"SUM(Z$3:Z87)","v":0},{"$f":"SUM(AA$3:AA87)","v":0},{"$f":"SUM(AB$3:AB87)","v":0},{"$f":"SUM(W$3:W87)","v":0},{"$f":"SUM(X$3:X87)","v":0},{"$f":"SUM(Y$3:Y87)","v":0},{"$f":"SUM(Z$3:Z87)","v":0},{"$f":"SUM(AA$3:AA87)","v":0},{"$f":"SUM(AB$3:AB87)","v":0}]
[10,"Sa 15:30",5,null,null,null,null,null,null,null,null,null,null,null,null,null,null,null,null,null,null,null,null,null,null,null,null,null,{"$f":"SUM(W$3:W88)","v":0},{"$f":"SUM(X$3:X88)","v":0},{"$f":"SUM(Y$3:Y88)","v":0},{"$f":"SUM(Z$3:Z88)","v":0},{"$f":"SUM(AA$3:AA88)","v":0},{"$f":"SUM(AB$3:AB88)","v":0},{"$f":"SUM(W$3:W88)","v":0},{"$f":"SUM(X$3:X88)","v":0},{"$f":"SUM(Y$3:Y88)","v":0},{"$f":"SUM(Z$3:Z88)","v":0},{"$f":"SUM(AA$3:AA88)","v":0},{"$f":"SUM(AB$3:AB88)","v":0}]
[10,"Sa 18:30",6,null,null,null,null,null,null,null,null,null,null,null,null,null,null,null,null,null,null,null,null,null,null,null,null,null,{"$f":"SUM(W$3:W89)","v":0},{"$f":"SUM(X$3:X89)","v":0},{"$f":"SUM(Y$3:Y89)","v":0},{"$f":"SUM(Z$3:Z89)","v":0},{"$f":"SUM(AA$3:AA89)","v":0},{"$f":"SUM(AB$3:AB89)","v":0},{"$f":"SUM(W$3:W89)","v":0},{"$f":"SUM(X$3:X89)","v":0},{"$f":"SUM(Y$3:Y89)","v":0},{"$f":"SUM(Z$3:Z89)","v":0},{"$f":"SUM(AA$3:AA89)","v":0},{"$f":"SUM(AB$3:AB89)","v":0}]
[10,"So 15:30",7,null,null,null,null,null,null,null,null,null,null,null,null,null,null,null,null,null,null,null,null,null,null,null,null,null,{"$f":"SUM(W$3:W90)","v":0},{"$f":"SUM(X$3:X90)","v":0},{"$f":"SUM(Y$3:Y90)","v":0},{"$f":"SUM(Z$3:Z90)","v":0},{"$f":"SUM(AA$3:AA90)","v":0},{"$f":"SUM(AB$3:AB90)","v":0},{"$f":"SUM(W$3:W90)","v":0},{"$f":"SUM(X$3:X90)","v":0},{"$f":"SUM(Y$3:Y90)","v":0},{"$f":"SUM(Z$3:Z90)","v":0},{"$f":"SUM(AA$3:AA90)","v":0},{"$f":"SUM(AB$3:AB90)","v":0}]
[10,"So 17:30",8,null,null,null,null,null,null,null,null,null,null,null,null,null,null,null,null,null,null,null,null,null,null,null,null,null,{"$f":"SUM(W$3:W91)","v":0},{"$f":"SUM(X$3:X91)","v":0},{"$f":"SUM(Y$3:Y91)","v":0},{"$f":"SUM(Z$3:Z91)","v":0},{"$f":"SUM(AA$3:AA91)","v":0},{"$f":"SUM(AB$3:AB91)","v":0},{"$f":"SUM(W$3:W91)","v":0},{"$f":"SUM(X$3:X91)","v":0},{"$f":"SUM(Y$3:Y91)","v":0},{"$f":"SUM(Z$3:Z91)","v":0},{"$f":"SUM(AA$3:AA91)","v":0},{"$f":"SUM(AB$3:AB91)","v":0}]
[10,"So 19:30",9,null,null,null,null,null,null,null,null,null,null,null,null,null,null,null,null,null,null,null,null,null,null,null,null,null,{"$f":"SUM(W$3:W92)","v":0},{"$f":"SUM(X$3:X92)","v":0},{"$f":"SUM(Y$3:Y92)","v":0},{"$f":"SUM(Z$3:Z92)","v":0},{"$f":"SUM(AA$3:AA92)","v":0},{"$f":"SUM(AB$3:AB92)","v":0},{"$f":"SUM(W$3:W92)","v":0},{"$f":"SUM(X$3:X92)","v":0},{"$f":"SUM(Y$3:Y92)","v":0},{"$f":"SUM(Z$3:Z92)","v":0},{"$f":"SUM(AA$3:AA92)","v":0},{"$f":"SUM(AB$3:AB92)","v":0}]
[11,"Fr 20:30",1,null,null,null,null,null,null,null,null,null,null,null,null,null,null,null,null,null,null,null,null,null,null,null,null,null,{"$f":"SUM(W$3:W93)","v":0},{"$f":"SUM(X$3:X93)","v":0},{"$f":"SUM(Y$3:Y93)","v":0},{"$f":"SUM(Z$3:Z93)","v":0},{"$f":"SUM(AA$3:AA93)","v":0},{"$f":"SUM(AB$3:AB93)","v":0},{"$f":"SUM(W$3:W93)","v":0},{"$f":"SUM(X$3:X93)","v":0},{"$f":"SUM(Y$3:Y93)","v":0},{"$f":"SUM(Z$3:Z93)","v":0},{"$f":"SUM(AA$3:AA93)","v":0},{"$f":"SUM(AB$3:AB93)","v":0}]
[11,"Sa 15:30",2,null,null,null,null,null,null,null,null,null,null,null,null,null,null,null,null,null,null,null,null,null,null,null,null,null,{"$f":"SUM(W$3:W94)","v":0},{"$f":"SUM(X$3:X94)","v":0},{"$f":"SUM(Y$3:Y94)","v":0},{"$f":"SUM(Z$3:Z94)","v":0},{"$f":"SUM(AA$3:AA94)","v":0},{"$f":"SUM(AB$3:AB94)","v":0},{"$f":"SUM(W$3:W94)","v":0},{"$f":"SUM(X$3:X94)","v":0},{"$f":"SUM(Y$3:Y94)","v":0},{"$f":"SUM(Z$3:Z94)","v":0},{"$f":"SUM(AA$3:AA94)","v":0},{"$f":"SUM(AB$3:AB94)","v":0}]
[11,"Sa 15:30",3,null,null,null,null,null,null,null,null,null,null,null,null,null,null,null,null,null,null,null,null,null,null,null,null,null,{"$f":"SUM(W$3:W95)","v":0},{"$f":"SUM(X$3:X95)","v":0},{"$f":"SUM(Y$3:Y95)","v":0},{"$f":"SUM(Z$3:Z95)","v":0},{"$f":"SUM(AA$3:AA95)","v":0},{"$f":"SUM(AB$3:AB95)","v":0},{"$f":"SUM(W$3:W95)","v":0},{"$f":"SUM(X$3:X95)","v":0},{"$f":"SUM(Y$3:Y95)","v":0},{"$f":"SUM(Z$3:Z95)","v":0},{"$f":"SUM(AA$3:AA95)","v":0},{"$f":"SUM(AB$3:AB95)","v":0}]
[11,"Sa 15:30",4,null,null,null,null,null,null,null,null,null,null,null,null,null,null,null,null,null,null,null,null,null,null,null,null,null,{"$f":"SUM(W$3:W96)","v":0},{"$f":"SUM(X$3:X96)","v":0},{"$f":"SUM(Y$3:Y96)","v":0},{"$f":"SUM(Z$3:Z96)","v":0},{"$f":"SUM(AA$3:AA96)","v":0},{"$f":"SUM(AB$3:AB96)","v":0},{"$f":"SUM(W$3:W96)","v":0},{"$f":"SUM(X$3:X96)","v":0},{"$f":"SUM(Y$3:Y96)","v":0},{"$f":"SUM(Z$3:Z96)","v":0},{"$f":"SUM(AA$3:AA96)","v":0},{"$f":"SUM(AB$3:AB96)","v":0}]
[11,"Sa 15:30",5,null,null,null,null,null,null,null,null,null,null,null,null,null,null,null,null,null,null,null,null,null,null,null,null,null,{"$f":"SUM(W$3:W97)","v":0},{"$f":"SUM(X$3:X97)","v":0},{"$f":"SUM(Y$3:Y97)","v":0},{"$f":"SUM(Z$3:Z97)","v":0},{"$f":"SUM(AA$3:AA97)","v":0},{"$f":"SUM(AB$3:AB97)","v":0},{"$f":"SUM(W$3:W97)","v":0},{"$f":"SUM(X$3:X97)","v":0},{"$f":"SUM(Y$3:Y97)","v":0},{"$f":"SUM(Z$3:Z97)","v":0},{"$f":"SUM(AA$3:AA97)","v":0},{"$f":"SUM(AB$3:AB97)","v":0}]
[11,"Sa 15:30",6,null,null,null,null,null,null,null,null,null,null,null,null,null,null,null,null,null,null,null,null,null,null,null,null,null,{"$f":"SUM(W$3:W98)","v":0},{"$f":"SUM(X$3:X98)","v":0},{"$f":"SUM(Y$3:Y98)","v":0},{"$f":"SUM(Z$3:Z98)","v":0},{"$f":"SUM(AA$3:AA98)","v":0},{"$f":"SUM(AB$3:AB98)","v":0},{"$f":"SUM(W$3:W98)","v":0},{"$f":"SUM(X$3:X98)","v":0},{"$f":"SUM(Y$3:Y98)","v":0},{"$f":"SUM(Z$3:Z98)","v":0},{"$f":"SUM(AA$3:AA98)","v":0},{"$f":"SUM(AB$3:AB98)","v":0}]
[11,"Sa 18:30",7,null,null,null,null,null,null,null,null,null,null,null,null,null,null,null,null,null,null,null,null,null,null,null,null,null,{"$f":"SUM(W$3:W99)","v":0},{"$f":"SUM(X$3:X99)","v":0},{"$f":"SUM(Y$3:Y99)","v":0},{"$f":"SUM(Z$3:Z99)","v":0},{"$f":"SUM(AA$3:AA99)","v":0},{"$f":"SUM(AB$3:AB99)","v":0},{"$f":"SUM(W$3:W99)","v":0},{"$f":"SUM(X$3:X99)","v":0},{"$f":"SUM(Y$3:Y99)","v":0},{"$f":"SUM(Z$3:Z99)","v":0},{"$f":"SUM(AA$3:AA99)","v":0},{"$f":"SUM(AB$3:AB99)","v":0}]
[11,"So 15:30",8,null,null,null,null,null,null,null,null,null,null,null,null,null,null,null,null,null,null,null,null,null,null,null,null,null,{"$f":"SUM(W$3:W100)","v":0},{"$f":"SUM(X$3:X100)","v":0},{"$f":"SUM(Y$3:Y100)","v":0},{"$f":"SUM(Z$3:Z100)","v":0},{"$f":"SUM(AA$3:AA100)","v":0},{"$f":"SUM(AB$3:AB100)","v":0},{"$f":"SUM(W$3:W100)","v":0},{"$f":"SUM(X$3:X100)","v":0},{"$f":"SUM(Y$3:Y100)","v":0},{"$f":"SUM(Z$3:Z100)","v":0},{"$f":"SUM(AA$3:AA100)","v":0},{"$f":"SUM(AB$3:AB100)","v":0}]
[11,"So 17:30",9,null,null,null,null,null,null,null,null,null,null,null,null,null,null,null,null,null,null,null,null,null,null,null,null,null,{"$f":"SUM(W$3:W101)","v":0},{"$f":"SUM(X$3:X101)","v":0},{"$f":"SUM(Y$3:Y101)","v":0},{"$f":"SUM(Z$3:Z101)","v":0},{"$f":"SUM(AA$3:AA101)","v":0},{"$f":"SUM(AB$3:AB101)","v":0},{"$f":"SUM(W$3:W101)","v":0},{"$f":"SUM(X$3:X101)","v":0},{"$f":"SUM(Y$3:Y101)","v":0},{"$f":"SUM(Z$3:Z101)","v":0},{"$f":"SUM(AA$3:AA101)","v":0},{"$f":"SUM(AB$3:AB101)","v":0}]
[12,"Fr 20:30",1,null,null,null,null,null,null,null,null,null,null,null,null,null,null,null,null,null,null,null,null,null,null,null,null,null,{"$f":"SUM(W$3:W102)","v":0},{"$f":"SUM(X$3:X102)","v":0},{"$f":"SUM(Y$3:Y102)","v":0},{"$f":"SUM(Z$3:Z102)","v":0},{"$f":"SUM(AA$3:AA102)","v":0},{"$f":"SUM(AB$3:AB102)","v":0},{"$f":"SUM(W$3:W102)","v":0},{"$f":"SUM(X$3:X102)","v":0},{"$f":"SUM(Y$3:Y102)","v":0},{"$f":"SUM(Z$3:Z102)","v":0},{"$f":"SUM(AA$3:AA102)","v":0},{"$f":"SUM(AB$3:AB102)","v":0}]
[12,"Sa 15:30",2,null,null,null,null,null,null,null,null,null,null,null,null,null,null,null,null,null,null,null,null,null,null,null,null,null,{"$f":"SUM(W$3:W103)","v":0},{"$f":"SUM(X$3:X103)","v":0},{"$f":"SUM(Y$3:Y103)","v":0},{"$f":"SUM(Z$3:Z103)","v":0},{"$f":"SUM(AA$3:AA103)","v":0},{"$f":"SUM(AB$3:AB103)","v":0},{"$f":"SUM(W$3:W103)","v":0},{"$f":"SUM(X$3:X103)","v":0},{"$f":"SUM(Y$3:Y103)","v":0},{"$f":"SUM(Z$3:Z103)","v":0},{"$f":"SUM(AA$3:AA103)","v":0},{"$f":"SUM(AB$3:AB103)","v":0}]
[12,"Sa 15:30",3,null,null,null,null,null,null,null,null,null,null,null,null,null,null,null,null,null,null,null,null,null,null,null,null,null,{"$f":"SUM(W$3:W104)","v":0},{"$f":"SUM(X$3:X104)","v":0},{"$f":"SUM(Y$3:Y104)","v":0},{"$f":"SUM(Z$3:Z104)","v":0},{"$f":"SUM(AA$3:AA104)","v":0},{"$f":"SUM(AB$3:AB104)","v":0},{"$f":"SUM(W$3:W104)","v":0},{"$f":"SUM(X$3:X104)","v":0},{"$f":"SUM(Y$3:Y104)","v":0},{"$f":"SUM(Z$3:Z104)","v":0},{"$f":"SUM(AA$3:AA104)","v":0},{"$f":"SUM(AB$3:AB104)","v":0}]
[12,"Sa 15:30",4,null,null,null,null,null,null,null,null,null,null,null,null,null,null,null,null,null,null,null,null,null,null,null,null,null,{"$f":"SUM(W$3:W105)","v":0},{"$f":"SUM(X$3:X105)","v":0},{"$f":"SUM(Y$3:Y105)","v":0},{"$f":"SUM(Z$3:Z105)","v":0},{"$f":"SUM(AA$3:AA105)","v":0},{"$f":"SUM(AB$3:AB105)","v":0},{"$f":"SUM(W$3:W105)","v":0},{"$f":"SUM(X$3:X105)","v":0},{"$f":"SUM(Y$3:Y105)","v":0},{"$f":"SUM(Z$3:Z105)","v":0},{"$f":"SUM(AA$3:AA105)","v":0},{"$f":"SUM(AB$3:AB105)","v":0}]
[12,"Sa 15:30",5,null,null,null,null,null,null,null,null,null,null,null,null,null,null,null,null,null,null,null,null,null,null,null,null,null,{"$f":"SUM(W$3:W106)","v":0},{"$f":"SUM(X$3:X106)","v":0},{"$f":"SUM(Y$3:Y106)","v":0},{"$f":"SUM(Z$3:Z106)","v":0},{"$f":"SUM(AA$3:AA106)","v":0},{"$f":"SUM(AB$3:AB106)","v":0},{"$f":"SUM(W$3:W106)","v":0},{"$f":"SUM(X$3:X106)","v":0},{"$f":"SUM(Y$3:Y106)","v":0},{"$f":"SUM(Z$3:Z106)","v":0},{"$f":"SUM(AA$3:AA106)","v":0},{"$f":"SUM(AB$3:AB106)","v":0}]
[12,"Sa 18:30",6,null,null,null,null,null,null,null,null,null,null,null,null,null,null,null,null,null,null,null,null,null,null,null,null,null,{"$f":"SUM(W$3:W107)","v":0},{"$f":"SUM(X$3:X107)","v":0},{"$f":"SUM(Y$3:Y107)","v":0},{"$f":"SUM(Z$3:Z107)","v":0},{"$f":"SUM(AA$3:AA107)","v":0},{"$f":"SUM(AB$3:AB107)","v":0},{"$f":"SUM(W$3:W107)","v":0},{"$f":"SUM(X$3:X107)","v":0},{"$f":"SUM(Y$3:Y107)","v":0},{"$f":"SUM(Z$3:Z107)","v":0},{"$f":"SUM(AA$3:AA107)","v":0},{"$f":"SUM(AB$3:AB107)","v":0}]
[12,"So 15:30",7,null,null,null,null,null,null,null,null,null,null,null,null,null,null,null,null,null,null,null,null,null,null,null,null,null,{"$f":"SUM(W$3:W108)","v":0},{"$f":"SUM(X$3:X108)","v":0},{"$f":"SUM(Y$3:Y108)","v":0},{"$f":"SUM(Z$3:Z108)","v":0},{"$f":"SUM(AA$3:AA108)","v":0},{"$f":"SUM(AB$3:AB108)","v":0},{"$f":"SUM(W$3:W108)","v":0},{"$f":"SUM(X$3:X108)","v":0},{"$f":"SUM(Y$3:Y108)","v":0},{"$f":"SUM(Z$3:Z108)","v":0},{"$f":"SUM(AA$3:AA108)","v":0},{"$f":"SUM(AB$3:AB108)","v":0}]
[12,"So 17:30",8,null,null,null,null,null,null,null,null,null,null,null,null,null,null,null,null,null,null,null,null,null,null,null,null,null,{"$f":"SUM(W$3:W109)","v":0},{"$f":"SUM(X$3:X109)","v":0},{"$f":"SUM(Y$3:Y109)","v":0},{"$f":"SUM(Z$3:Z109)","v":0},{"$f":"SUM(AA$3:AA109)","v":0},{"$f":"SUM(AB$3:AB109)","v":0},{"$f":"SUM(W$3:W109)","v":0},{"$f":"SUM(X$3:X109)","v":0},{"$f":"SUM(Y$3:Y109)","v":0},{"$f":"SUM(Z$3:Z109)","v":0},{"$f":"SUM(AA$3:AA109)","v":0},{"$f":"SUM(AB$3:AB109)","v":0}]
[12,"So 19:30",9,null,null,null,null,null,null,null,null,null,null,null,null,null,null,null,null,null,null,null,null,null,null,null,null,null,{"$f":"SUM(W$3:W110)","v":0},{"$f":"SUM(X$3:X110)","v":0},{"$f":"SUM(Y$3:Y110)","v":0},{"$f":"SUM(Z$3:Z110)","v":0},{"$f":"SUM(AA$3:AA110)","v":0},{"$f":"SUM(AB$3:AB110)","v":0},{"$f":"SUM(W$3:W110)","v":0},{"$f":"SUM(X$3:X110)","v":0},{"$f":"SUM(Y$3:Y110)","v":0},{"$f":"SUM(Z$3:Z110)","v":0},{"$f":"SUM(AA$3:AA110)","v":0},{"$f":"SUM(AB$3:AB110)","v":0}]
[13,"Fr 20:30",1,null,null,null,null,null,null,null,null,null,null,null,null,null,null,null,null,null,null,null,null,null,null,null,null,null,{"$f":"SUM(W$3:W111)","v":0},{"$f":"SUM(X$3:X111)","v":0},{"$f":"SUM(Y$3:Y111)","v":0},{"$f":"SUM(Z$3:Z111)","v":0},{"$f":"SUM(AA$3:AA111)","v":0},{"$f":"SUM(AB$3:AB111)","v":0},{"$f":"SUM(W$3:W111)","v":0},{"$f":"SUM(X$3:X111)","v":0},{"$f":"SUM(Y$3:Y111)","v":0},{"$f":"SUM(Z$3:Z111)","v":0},{"$f":"SUM(AA$3:AA111)","v":0},{"$f":"SUM(AB$3:AB111)","v":0}]
[13,"Sa 15:30",2,null,null,null,null,null,null,null,null,null,null,null,null,null,null,null,null,null,null,null,null,null,null,null,null,null,{"$f":"SUM(W$3:W112)","v":0},{"$f":"SUM(X$3:X112)","v":0},{"$f":"SUM(Y$3:Y112)","v":0},{"$f":"SUM(Z$3:Z112)","v":0},{"$f":"SUM(AA$3:AA112)","v":0},{"$f":"SUM(AB$3:AB112)","v":0},{"$f":"SUM(W$3:W112)","v":0},{"$f":"SUM(X$3:X112)","v":0},{"$f":"SUM(Y$3:Y112)","v":0},{"$f":"SUM(Z$3:Z112)","v":0},{"$f":"SUM(AA$3:AA112)","v":0},{"$f":"SUM(AB$3:AB112)","v":0}]
[13,"Sa 15:30",3,null,null,null,null,null,null,null,null,null,null,null,null,null,null,null,null,null,null,null,null,null,null,null,null,null,{"$f":"SUM(W$3:W113)","v":0},{"$f":"SUM(X$3:X113)","v":0},{"$f":"SUM(Y$3:Y113)","v":0},{"$f":"SUM(Z$3:Z113)","v":0},{"$f":"SUM(AA$3:AA113)","v":0},{"$f":"SUM(AB$3:AB113)","v":0},{"$f":"SUM(W$3:W113)","v":0},{"$f":"SUM(X$3:X113)","v":0},{"$f":"SUM(Y$3:Y113)","v":0},{"$f":"SUM(Z$3:Z113)","v":0},{"$f":"SUM(AA$3:AA113)","v":0},{"$f":"SUM(AB$3:AB113)","v":0}]
[13,"Sa 15:30",4,null,null,null,null,null,null,null,null,null,null,null,null,null,null,null,null,null,null,null,null,null,null,null,null,null,{"$f":"SUM(W$3:W114)","v":0},{"$f":"SUM(X$3:X114)","v":0},{"$f":"SUM(Y$3:Y114)","v":0},{"$f":"SUM(Z$3:Z114)","v":0},{"$f":"SUM(AA$3:AA114)","v":0},{"$f":"SUM(AB$3:AB114)","v":0},{"$f":"SUM(W$3:W114)","v":0},{"$f":"SUM(X$3:X114)","v":0},{"$f":"SUM(Y$3:Y114)","v":0},{"$f":"SUM(Z$3:Z114)","v":0},{"$f":"SUM(AA$3:AA114)","v":0},{"$f":"SUM(AB$3:AB114)","v":0}]
[13,"Sa 15:30",5,null,null,null,null,null,null,null,null,null,null,null,null,null,null,null,null,null,null,null,null,null,null,null,null,null,{"$f":"SUM(W$3:W115)","v":0},{"$f":"SUM(X$3:X115)","v":0},{"$f":"SUM(Y$3:Y115)","v":0},{"$f":"SUM(Z$3:Z115)","v":0},{"$f":"SUM(AA$3:AA115)","v":0},{"$f":"SUM(AB$3:AB115)","v":0},{"$f":"SUM(W$3:W115)","v":0},{"$f":"SUM(X$3:X115)","v":0},{"$f":"SUM(Y$3:Y115)","v":0},{"$f":"SUM(Z$3:Z115)","v":0},{"$f":"SUM(AA$3:AA115)","v":0},{"$f":"SUM(AB$3:AB115)","v":0}]
[13,"Sa 15:30",6,null,null,null,null,null,null,null,null,null,null,null,null,null,null,null,null,null,null,null,null,null,null,null,null,null,{"$f":"SUM(W$3:W116)","v":0},{"$f":"SUM(X$3:X116)","v":0},{"$f":"SUM(Y$3:Y116)","v":0},{"$f":"SUM(Z$3:Z116)","v":0},{"$f":"SUM(AA$3:AA116)","v":0},{"$f":"SUM(AB$3:AB116)","v":0},{"$f":"SUM(W$3:W116)","v":0},{"$f":"SUM(X$3:X116)","v":0},{"$f":"SUM(Y$3:Y116)","v":0},{"$f":"SUM(Z$3:Z116)","v":0},{"$f":"SUM(AA$3:AA116)","v":0},{"$f":"SUM(AB$3:AB116)","v":0}]
[13,"Sa 18:30",7,null,null,null,null,null,null,null,null,null,null,null,null,null,null,null,null,null,null,null,null,null,null,null,null,null,{"$f":"SUM(W$3:W117)","v":0},{"$f":"SUM(X$3:X117)","v":0},{"$f":"SUM(Y$3:Y117)","v":0},{"$f":"SUM(Z$3:Z117)","v":0},{"$f":"SUM(AA$3:AA117)","v":0},{"$f":"SUM(AB$3:AB117)","v":0},{"$f":"SUM(W$3:W117)","v":0},{"$f":"SUM(X$3:X117)","v":0},{"$f":"SUM(Y$3:Y117)","v":0},{"$f":"SUM(Z$3:Z117)","v":0},{"$f":"SUM(AA$3:AA117)","v":0},{"$f":"SUM(AB$3:AB117)","v":0}]
[13,"So 15:30",8,null,null,null,null,null,null,null,null,null,null,null,null,null,null,null,null,null,null,null,null,null,null,null,null,null,{"$f":"SUM(W$3:W118)","v":0},{"$f":"SUM(X$3:X118)","v":0},{"$f":"SUM(Y$3:Y118)","v":0},{"$f":"SUM(Z$3:Z118)","v":0},{"$f":"SUM(AA$3:AA118)","v":0},{"$f":"SUM(AB$3:AB118)","v":0},{"$f":"SUM(W$3:W118)","v":0},{"$f":"SUM(X$3:X118)","v":0},{"$f":"SUM(Y$3:Y118)","v":0},{"$f":"SUM(Z$3:Z118)","v":0},{"$f":"SUM(AA$3:AA118)","v":0},{"$f":"SUM(AB$3:AB118)","v":0}]
[13,"So 17:30",9,null,null,null,null,null,null,null,null,null,null,null,null,null,null,null,null,null,null,null,null,null,null,null,null,null,{"$f":"SUM(W$3:W119)","v":0},{"$f":"SUM(X$3:X119)","v":0},{"$f":"SUM(Y$3:Y119)","v":0},{"$f":"SUM(Z$3:Z119)","v":0},{"$f":"SUM(AA$3:AA119)","v":0},{"$f":"SUM(AB$3:AB119)","v":0},{"$f":"SUM(W$3:W119)","v":0},{"$f":"SUM(X$3:X119)","v":0},{"$f":"SUM(Y$3:Y119)","v":0},{"$f":"SUM(Z$3:Z119)","v":0},{"$f":"SUM(AA$3:AA119)","v":0},{"$f":"SUM(AB$3:AB119)","v":0}]
[14,"Fr 20:30",1,null,null,null,null,null,null,null,null,null,null,null,null,null,null,null,null,null,null,null,null,null,null,null,null,null,{"$f":"SUM(W$3:W120)","v":0},{"$f":"SUM(X$3:X120)","v":0},{"$f":"SUM(Y$3:Y120)","v":0},{"$f":"SUM(Z$3:Z120)","v":0},{"$f":"SUM(AA$3:AA120)","v":0},{"$f":"SUM(AB$3:AB120)","v":0},{"$f":"SUM(W$3:W120)","v":0},{"$f":"SUM(X$3:X120)","v":0},{"$f":"SUM(Y$3:Y120)","v":0},{"$f":"SUM(Z$3:Z120)","v":0},{"$f":"SUM(AA$3:AA120)","v":0},{"$f":"SUM(AB$3:AB120)","v":0}]
[14,"Sa 15:30",2,null,null,null,null,null,null,null,null,null,null,null,null,null,null,null,null,null,null,null,null,null,null,null,null,null,{"$f":"SUM(W$3:W121)","v":0},{"$f":"SUM(X$3:X121)","v":0},{"$f":"SUM(Y$3:Y121)","v":0},{"$f":"SUM(Z$3:Z121)","v":0},{"$f":"SUM(AA$3:AA121)","v":0},{"$f":"SUM(AB$3:AB121)","v":0},{"$f":"SUM(W$3:W121)","v":0},{"$f":"SUM(X$3:X121)","v":0},{"$f":"SUM(Y$3:Y121)","v":0},{"$f":"SUM(Z$3:Z121)","v":0},{"$f":"SUM(AA$3:AA121)","v":0},{"$f":"SUM(AB$3:AB121)","v":0}]
[14,"Sa 15:30",3,null,null,null,null,null,null,null,null,null,null,null,null,null,null,null,null,null,null,null,null,null,null,null,null,null,{"$f":"SUM(W$3:W122)","v":0},{"$f":"SUM(X$3:X122)","v":0},{"$f":"SUM(Y$3:Y122)","v":0},{"$f":"SUM(Z$3:Z122)","v":0},{"$f":"SUM(AA$3:AA122)","v":0},{"$f":"SUM(AB$3:AB122)","v":0},{"$f":"SUM(W$3:W122)","v":0},{"$f":"SUM(X$3:X122)","v":0},{"$f":"SUM(Y$3:Y122)","v":0},{"$f":"SUM(Z$3:Z122)","v":0},{"$f":"SUM(AA$3:AA122)","v":0},{"$f":"SUM(AB$3:AB122)","v":0}]
[14,"Sa 15:30",4,null,null,null,null,null,null,null,null,null,null,null,null,null,null,null,null,null,null,null,null,null,null,null,null,null,{"$f":"SUM(W$3:W123)","v":0},{"$f":"SUM(X$3:X123)","v":0},{"$f":"SUM(Y$3:Y123)","v":0},{"$f":"SUM(Z$3:Z123)","v":0},{"$f":"SUM(AA$3:AA123)","v":0},{"$f":"SUM(AB$3:AB123)","v":0},{"$f":"SUM(W$3:W123)","v":0},{"$f":"SUM(X$3:X123)","v":0},{"$f":"SUM(Y$3:Y123)","v":0},{"$f":"SUM(Z$3:Z123)","v":0},{"$f":"SUM(AA$3:AA123)","v":0},{"$f":"SUM(AB$3:AB123)","v":0}]
[14,"Sa 15:30",5,null,null,null,null,null,null,null,null,null,null,null,null,null,null,null,null,null,null,null,null,null,null,null,null,null,{"$f":"SUM(W$3:W124)","v":0},{"$f":"SUM(X$3:X124)","v":0},{"$f":"SUM(Y$3:Y124)","v":0},{"$f":"SUM(Z$3:Z124)","v":0},{"$f":"SUM(AA$3:AA124)","v":0},{"$f":"SUM(AB$3:AB124)","v":0},{"$f":"SUM(W$3:W124)","v":0},{"$f":"SUM(X$3:X124)","v":0},{"$f":"SUM(Y$3:Y124)","v":0},{"$f":"SUM(Z$3:Z124)","v":0},{"$f":"SUM(AA$3:AA124)","v":0},{"$f":"SUM(AB$3:AB124)","v":0}]
[14,"Sa 18:30",6,null,null,null,null,null,null,null,null,null,null,null,null,null,null,null,null,null,null,null,null,null,null,null,null,null,{"$f":"SUM(W$3:W125)","v":0},{"$f":"SUM(X$3:X125)","v":0},{"$f":"SUM(Y$3:Y125)","v":0},{"$f":"SUM(Z$3:Z125)","v":0},{"$f":"SUM(AA$3:AA125)","v":0},{"$f":"SUM(AB$3:AB125)","v":0},{"$f":"SUM(W$3:W125)","v":0},{"$f":"SUM(X$3:X125)","v":0},{"$f":"SUM(Y$3:Y125)","v":0},{"$f":"SUM(Z$3:Z125)","v":0},{"$f":"SUM(AA$3:AA125)","v":0},{"$f":"SUM(AB$3:AB125)","v":0}]
[14,"So 15:30",7,null,null,null,null,null,null,null,null,null,null,null,null,null,null,null,null,null,null,null,null,null,null,null,null,null,{"$f":"SUM(W$3:W126)","v":0},{"$f":"SUM(X$3:X126)","v":0},{"$f":"SUM(Y$3:Y126)","v":0},{"$f":"SUM(Z$3:Z126)","v":0},{"$f":"SUM(AA$3:AA126)","v":0},{"$f":"SUM(AB$3:AB126)","v":0},{"$f":"SUM(W$3:W126)","v":0},{"$f":"SUM(X$3:X126)","v":0},{"$f":"SUM(Y$3:Y126)","v":0},{"$f":"SUM(Z$3:Z126)","v":0},{"$f":"SUM(AA$3:AA126)","v":0},{"$f":"SUM(AB$3:AB126)","v":0}]
[14,"So 17:30",8,null,null,null,null,null,null,null,null,null,null,null,null,null,null,null,null,null,null,null,null,null,null,null,null,null,{"$f":"SUM(W$3:W127)","v":0},{"$f":"SUM(X$3:X127)","v":0},{"$f":"SUM(Y$3:Y127)","v":0},{"$f":"SUM(Z$3:Z127)","v":0},{"$f":"SUM(AA$3:AA127)","v":0},{"$f":"SUM(AB$3:AB127)","v":0},{"$f":"SUM(W$3:W127)","v":0},{"$f":"SUM(X$3:X127)","v":0},{"$f":"SUM(Y$3:Y127)","v":0},{"$f":"SUM(Z$3:Z127)","v":0},{"$f":"SUM(AA$3:AA127)","v":0},{"$f":"SUM(AB$3:AB127)","v":0}]
[14,"So 19:30",9,null,null,null,null,null,null,null,null,null,null,null,null,null,null,null,null,null,null,null,null,null,null,null,null,null,{"$f":"SUM(W$3:W128)","v":0},{"$f":"SUM(X$3:X128)","v":0},{"$f":"SUM(Y$3:Y128)","v":0},{"$f":"SUM(Z$3:Z128)","v":0},{"$f":"SUM(AA$3:AA128)","v":0},{"$f":"SUM(AB$3:AB128)","v":0},{"$f":"SUM(W$3:W128)","v":0},{"$f":"SUM(X$3:X128)","v":0},{"$f":"SUM(Y$3:Y128)","v":0},{"$f":"SUM(Z$3:Z128)","v":0},{"$f":"SUM(AA$3:AA128)","v":0},{"$f":"SUM(AB$3:AB128)","v":0}]
[15,"Fr 20:30",1,null,null,null,null,null,null,null,null,null,null,null,null,null,null,null,null,null,null,null,null,null,null,null,null,null,{"$f":"SUM(W$3:W129)","v":0},{"$f":"SUM(X$3:X129)","v":0},{"$f":"SUM(Y$3:Y129)","v":0},{"$f":"SUM(Z$3:Z129)","v":0},{"$f":"SUM(AA$3:AA129)","v":0},{"$f":"SUM(AB$3:AB129)","v":0},{"$f":"SUM(W$3:W129)","v":0},{"$f":"SUM(X$3:X129)","v":0},{"$f":"SUM(Y$3:Y129)","v":0},{"$f":"SUM(Z$3:Z129)","v":0},{"$f":"SUM(AA$3:AA129)","v":0},{"$f":"SUM(AB$3:AB129)","v":0}]
[15,"Sa 15:30",2,null,null,null,null,null,null,null,null,null,null,null,null,null,null,null,null,null,null,null,null,null,null,null,null,null,{"$f":"SUM(W$3:W130)","v":0},{"$f":"SUM(X$3:X130)","v":0},{"$f":"SUM(Y$3:Y130)","v":0},{"$f":"SUM(Z$3:Z130)","v":0},{"$f":"SUM(AA$3:AA130)","v":0},{"$f":"SUM(AB$3:AB130)","v":0},{"$f":"SUM(W$3:W130)","v":0},{"$f":"SUM(X$3:X130)","v":0},{"$f":"SUM(Y$3:Y130)","v":0},{"$f":"SUM(Z$3:Z130)","v":0},{"$f":"SUM(AA$3:AA130)","v":0},{"$f":"SUM(AB$3:AB130)","v":0}]
[15,"Sa 15:30",3,null,null,null,null,null,null,null,null,null,null,null,null,null,null,null,null,null,null,null,null,null,null,null,null,null,{"$f":"SUM(W$3:W131)","v":0},{"$f":"SUM(X$3:X131)","v":0},{"$f":"SUM(Y$3:Y131)","v":0},{"$f":"SUM(Z$3:Z131)","v":0},{"$f":"SUM(AA$3:AA131)","v":0},{"$f":"SUM(AB$3:AB131)","v":0},{"$f":"SUM(W$3:W131)","v":0},{"$f":"SUM(X$3:X131)","v":0},{"$f":"SUM(Y$3:Y131)","v":0},{"$f":"SUM(Z$3:Z131)","v":0},{"$f":"SUM(AA$3:AA131)","v":0},{"$f":"SUM(AB$3:AB131)","v":0}]
[15,"Sa 15:30",4,null,null,null,null,null,null,null,null,null,null,null,null,null,null,null,null,null,null,null,null,null,null,null,null,null,{"$f":"SUM(W$3:W132)","v":0},{"$f":"SUM(X$3:X132)","v":0},{"$f":"SUM(Y$3:Y132)","v":0},{"$f":"SUM(Z$3:Z132)","v":0},{"$f":"SUM(AA$3:AA132)","v":0},{"$f":"SUM(AB$3:AB132)","v":0},{"$f":"SUM(W$3:W132)","v":0},{"$f":"SUM(X$3:X132)","v":0},{"$f":"SUM(Y$3:Y132)","v":0},{"$f":"SUM(Z$3:Z132)","v":0},{"$f":"SUM(AA$3:AA132)","v":0},{"$f":"SUM(AB$3:AB132)","v":0}]
[15,"Sa 15:30",5,null,null,null,null,null,null,null,null,null,null,null,null,null,null,null,null,null,null,null,null,null,null,null,null,null,{"$f":"SUM(W$3:W133)","v":0},{"$f":"SUM(X$3:X133)","v":0},{"$f":"SUM(Y$3:Y133)","v":0},{"$f":"SUM(Z$3:Z133)","v":0},{"$f":"SUM(AA$3:AA133)","v":0},{"$f":"SUM(AB$3:AB133)","v":0},{"$f":"SUM(W$3:W133)","v":0},{"$f":"SUM(X$3:X133)","v":0},{"$f":"SUM(Y$3:Y133)","v":0},{"$f":"SUM(Z$3:Z133)","v":0},{"$f":"SUM(AA$3:AA133)","v":0},{"$f":"SUM(AB$3:AB133)","v":0}]
[15,"Sa 15:30",6,null,null,null,null,null,null,null,null,null,null,null,null,null,null,null,null,null,null,null,null,null,null,null,null,null,{"$f":"SUM(W$3:W134)","v":0},{"$f":"SUM(X$3:X134)","v":0},{"$f":"SUM(Y$3:Y134)","v":0},{"$f":"SUM(Z$3:Z134)","v":0},{"$f":"SUM(AA$3:AA134)","v":0},{"$f":"SUM(AB$3:AB134)","v":0},{"$f":"SUM(W$3:W134)","v":0},{"$f":"SUM(X$3:X134)","v":0},{"$f":"SUM(Y$3:Y134)","v":0},{"$f":"SUM(Z$3:Z134)","v":0},{"$f":"SUM(AA$3:AA134)","v":0},{"$f":"SUM(AB$3:AB134)","v":0}]
[15,"Sa 18:30",7,null,null,null,null,null,null,null,null,null,null,null,null,null,null,null,null,null,null,null,null,null,null,null,null,null,{"$f":"SUM(W$3:W135)","v":0},{"$f":"SUM(X$3:X135)","v":0},{"$f":"SUM(Y$3:Y135)","v":0},{"$f":"SUM(Z$3:Z135)","v":0},{"$f":"SUM(AA$3:AA135)","v":0},{"$f":"SUM(AB$3:AB135)","v":0},{"$f":"SUM(W$3:W135)","v":0},{"$f":"SUM(X$3:X135)","v":0},{"$f":"SUM(Y$3:Y135)","v":0},{"$f":"SUM(Z$3:Z135)","v":0},{"$f":"SUM(AA$3:AA135)","v":0},{"$f":"SUM(AB$3:AB135)","v":0}]
[15,"So 15:30",8,null,null,null,null,null,null,null,null,null,null,null,null,null,null,null,null,null,null,null,null,null,null,null,null,null,{"$f":"SUM(W$3:W136)","v":0},{"$f":"SUM(X$3:X136)","v":0},{"$f":"SUM(Y$3:Y136)","v":0},{"$f":"SUM(Z$3:Z136)","v":0},{"$f":"SUM(AA$3:AA136)","v":0},{"$f":"SUM(AB$3:AB136)","v":0},{"$f":"SUM(W$3:W136)","v":0},{"$f":"SUM(X$3:X136)","v":0},{"$f":"SUM(Y$3:Y136)","v":0},{"$f":"SUM(Z$3:Z136)","v":0},{"$f":"SUM(AA$3:AA136)","v":0},{"$f":"SUM(AB$3:AB136)","v":0}]
[15,"So 17:30",9,null,null,null,null,null,null,null,null,null,null,null,null,null,null,null,null,null,null,null,null,null,null,null,null,null,{"$f":"SUM(W$3:W137)","v":0},{"$f":"SUM(X$3:X137)","v":0},{"$f":"SUM(Y$3:Y137)","v":0},{"$f":"SUM(Z$3:Z137)","v":0},{"$f":"SUM(AA$3:AA137)","v":0},{"$f":"SUM(AB$3:AB137)","v":0},{"$f":"SUM(W$3:W137)","v":0},{"$f":"SUM(X$3:X137)","v":0},{"$f":"SUM(Y$3:Y137)","v":0},{"$f":"SUM(Z$3:Z137)","v":0},{"$f":"SUM(AA$3:AA137)","v":0},{"$f":"SUM(AB$3:AB137)","v":0}]
[16,"Fr 20:30",1,null,null,null,null,null,null,null,null,null,null,null,null,null,null,null,null,null,null,null,null,null,null,null,null,null,{"$f":"SUM(W$3:W138)","v":0},{"$f":"SUM(X$3:X138)","v":0},{"$f":"SUM(Y$3:Y138)","v":0},{"$f":"SUM(Z$3:Z138)","v":0},{"$f":"SUM(AA$3:AA138)","v":0},{"$f":"SUM(AB$3:AB138)","v":0},{"$f":"SUM(W$3:W138)","v":0},{"$f":"SUM(X$3:X138)","v":0},{"$f":"SUM(Y$3:Y138)","v":0},{"$f":"SUM(Z$3:Z138)","v":0},{"$f":"SUM(AA$3:AA138)","v":0},{"$f":"SUM(AB$3:AB138)","v":0}]
[16,"Sa 15:30",2,null,null,null,null,null,null,null,null,null,null,null,null,null,null,null,null,null,null,null,null,null,null,null,null,null,{"$f":"SUM(W$3:W139)","v":0},{"$f":"SUM(X$3:X139)","v":0},{"$f":"SUM(Y$3:Y139)","v":0},{"$f":"SUM(Z$3:Z139)","v":0},{"$f":"SUM(AA$3:AA139)","v":0},{"$f":"SUM(AB$3:AB139)","v":0},{"$f":"SUM(W$3:W139)","v":0},{"$f":"SUM(X$3:X139)","v":0},{"$f":"SUM(Y$3:Y139)","v":0},{"$f":"SUM(Z$3:Z139)","v":0},{"$f":"SUM(AA$3:AA139)","v":0},{"$f":"SUM(AB$3:AB139)","v":0}]
[16,"Sa 15:30",3,null,null,null,null,null,null,null,null,null,null,null,null,null,null,null,null,null,null,null,null,null,null,null,null,null,{"$f":"SUM(W$3:W140)","v":0},{"$f":"SUM(X$3:X140)","v":0},{"$f":"SUM(Y$3:Y140)","v":0},{"$f":"SUM(Z$3:Z140)","v":0},{"$f":"SUM(AA$3:AA140)","v":0},{"$f":"SUM(AB$3:AB140)","v":0},{"$f":"SUM(W$3:W140)","v":0},{"$f":"SUM(X$3:X140)","v":0},{"$f":"SUM(Y$3:Y140)","v":0},{"$f":"SUM(Z$3:Z140)","v":0},{"$f":"SUM(AA$3:AA140)","v":0},{"$f":"SUM(AB$3:AB140)","v":0}]
[16,"Sa 15:30",4,null,null,null,null,null,null,null,null,null,null,null,null,null,null,null,null,null,null,null,null,null,null,null,null,null,{"$f":"SUM(W$3:W141)","v":0},{"$f":"SUM(X$3:X141)","v":0},{"$f":"SUM(Y$3:Y141)","v":0},{"$f":"SUM(Z$3:Z141)","v":0},{"$f":"SUM(AA$3:AA141)","v":0},{"$f":"SUM(AB$3:AB141)","v":0},{"$f":"SUM(W$3:W141)","v":0},{"$f":"SUM(X$3:X141)","v":0},{"$f":"SUM(Y$3:Y141)","v":0},{"$f":"SUM(Z$3:Z141)","v":0},{"$f":"SUM(AA$3:AA141)","v":0},{"$f":"SUM(AB$3:AB141)","v":0}]
[16,"Sa 15:30",5,null,null,null,null,null,null,null,null,null,null,null,null,null,null,null,null,null,null,null,null,null,null,null,null,null,{"$f":"SUM(W$3:W142)","v":0},{"$f":"SUM(X$3:X142)","v":0},{"$f":"SUM(Y$3:Y142)","v":0},{"$f":"SUM(Z$3:Z142)","v":0},{"$f":"SUM(AA$3:AA142)","v":0},{"$f":"SUM(AB$3:AB142)","v":0},{"$f":"SUM(W$3:W142)","v":0},{"$f":"SUM(X$3:X142)","v":0},{"$f":"SUM(Y$3:Y142)","v":0},{"$f":"SUM(Z$3:Z142)","v":0},{"$f":"SUM(AA$3:AA142)","v":0},{"$f":"SUM(AB$3:AB142)","v":0}]
[16,"Sa 15:30",6,null,null,null,null,null,null,null,null,null,null,null,null,null,null,null,null,null,null,null,null,null,null,null,null,null,{"$f":"SUM(W$3:W143)","v":0},{"$f":"SUM(X$3:X143)","v":0},{"$f":"SUM(Y$3:Y143)","v":0},{"$f":"SUM(Z$3:Z143)","v":0},{"$f":"SUM(AA$3:AA143)","v":0},{"$f":"SUM(AB$3:AB143)","v":0},{"$f":"SUM(W$3:W143)","v":0},{"$f":"SUM(X$3:X143)","v":0},{"$f":"SUM(Y$3:Y143)","v":0},{"$f":"SUM(Z$3:Z143)","v":0},{"$f":"SUM(AA$3:AA143)","v":0},{"$f":"SUM(AB$3:AB143)","v":0}]
[16,"Sa 18:30",7,null,null,null,null,null,null,null,null,null,null,null,null,null,null,null,null,null,null,null,null,null,null,null,null,null,{"$f":"SUM(W$3:W144)","v":0},{"$f":"SUM(X$3:X144)","v":0},{"$f":"SUM(Y$3:Y144)","v":0},{"$f":"SUM(Z$3:Z144)","v":0},{"$f":"SUM(AA$3:AA144)","v":0},{"$f":"SUM(AB$3:AB144)","v":0},{"$f":"SUM(W$3:W144)","v":0},{"$f":"SUM(X$3:X144)","v":0},{"$f":"SUM(Y$3:Y144)","v":0},{"$f":"SUM(Z$3:Z144)","v":0},{"$f":"SUM(AA$3:AA144)","v":0},{"$f":"SUM(AB$3:AB144)","v":0}]
[16,"So 15:30",8,null,null,null,null,null,null,null,null,null,null,null,null,null,null,null,null,null,null,null,null,null,null,null,null,null,{"$f":"SUM(W$3:W145)","v":0},{"$f":"SUM(X$3:X145)","v":0},{"$f":"SUM(Y$3:Y145)","v":0},{"$f":"SUM(Z$3:Z145)","v":0},{"$f":"SUM(AA$3:AA145)","v":0},{"$f":"SUM(AB$3:AB145)","v":0},{"$f":"SUM(W$3:W145)","v":0},{"$f":"SUM(X$3:X145)","v":0},{"$f":"SUM(Y$3:Y145)","v":0},{"$f":"SUM(Z$3:Z145)","v":0},{"$f":"SUM(AA$3:AA145)","v":0},{"$f":"SUM(AB$3:AB145)","v":0}]
[16,"So 17:30",9,null,null,null,null,null,null,null,null,null,null,null,null,null,null,null,null,null,null,null,null,null,null,null,null,null,{"$f":"SUM(W$3:W146)","v":0},{"$f":"SUM(X$3:X146)","v":0},{"$f":"SUM(Y$3:Y146)","v":0},{"$f":"SUM(Z$3:Z146)","v":0},{"$f":"SUM(AA$3:AA146)","v":0},{"$f":"SUM(AB$3:AB146)","v":0},{"$f":"SUM(W$3:W146)","v":0},{"$f":"SUM(X$3:X146)","v":0},{"$f":"SUM(Y$3:Y146)","v":0},{"$f":"SUM(Z$3:Z146)","v":0},{"$f":"SUM(AA$3:AA146)","v":0},{"$f":"SUM(AB$3:AB146)","v":0}]
[17,"Di 18:30",1,null,null,null,null,null,null,null,null,null,null,null,null,null,null,null,null,null,null,null,null,null,null,null,null,null,{"$f":"SUM(W$3:W147)","v":0},{"$f":"SUM(X$3:X147)","v":0},{"$f":"SUM(Y$3:Y147)","v":0},{"$f":"SUM(Z$3:Z147)","v":0},{"$f":"SUM(AA$3:AA147)","v":0},{"$f":"SUM(AB$3:AB147)","v":0},{"$f":"SUM(W$3:W147)","v":0},{"$f":"SUM(X$3:X147)","v":0},{"$f":"SUM(Y$3:Y147)","v":0},{"$f":"SUM(Z$3:Z147)","v":0},{"$f":"SUM(AA$3:AA147)","v":0},{"$f":"SUM(AB$3:AB147)","v":0}]
[17,"Di 20:30",2,null,null,null,null,null,null,null,null,null,null,null,null,null,null,null,null,null,null,null,null,null,null,null,null,null,{"$f":"SUM(W$3:W148)","v":0},{"$f":"SUM(X$3:X148)","v":0},{"$f":"SUM(Y$3:Y148)","v":0},{"$f":"SUM(Z$3:Z148)","v":0},{"$f":"SUM(AA$3:AA148)","v":0},{"$f":"SUM(AB$3:AB148)","v":0},{"$f":"SUM(W$3:W148)","v":0},{"$f":"SUM(X$3:X148)","v":0},{"$f":"SUM(Y$3:Y148)","v":0},{"$f":"SUM(Z$3:Z148)","v":0},{"$f":"SUM(AA$3:AA148)","v":0},{"$f":"SUM(AB$3:AB148)","v":0}]
[17,"Di 20:30",3,null,null,null,null,null,null,null,null,null,null,null,null,null,null,null,null,null,null,null,null,null,null,null,null,null,{"$f":"SUM(W$3:W149)","v":0},{"$f":"SUM(X$3:X149)","v":0},{"$f":"SUM(Y$3:Y149)","v":0},{"$f":"SUM(Z$3:Z149)","v":0},{"$f":"SUM(AA$3:AA149)","v":0},{"$f":"SUM(AB$3:AB149)","v":0},{"$f":"SUM(W$3:W149)","v":0},{"$f":"SUM(X$3:X149)","v":0},{"$f":"SUM(Y$3:Y149)","v":0},{"$f":"SUM(Z$3:Z149)","v":0},{"$f":"SUM(AA$3:AA149)","v":0},{"$f":"SUM(AB$3:AB149)","v":0}]
[17,"Di 20:30",4,null,null,null,null,null,null,null,null,null,null,null,null,null,null,null,null,null,null,null,null,null,null,null,null,null,{"$f":"SUM(W$3:W150)","v":0},{"$f":"SUM(X$3:X150)","v":0},{"$f":"SUM(Y$3:Y150)","v":0},{"$f":"SUM(Z$3:Z150)","v":0},{"$f":"SUM(AA$3:AA150)","v":0},{"$f":"SUM(AB$3:AB150)","v":0},{"$f":"SUM(W$3:W150)","v":0},{"$f":"SUM(X$3:X150)","v":0},{"$f":"SUM(Y$3:Y150)","v":0},{"$f":"SUM(Z$3:Z150)","v":0},{"$f":"SUM(AA$3:AA150)","v":0},{"$f":"SUM(AB$3:AB150)","v":0}]
[17,"Mi 18:30",5,null,null,null,null,null,null,null,null,null,null,null,null,null,null,null,null,null,null,null,null,null,null,null,null,null,{"$f":"SUM(W$3:W151)","v":0},{"$f":"SUM(X$3:X151)","v":0},{"$f":"SUM(Y$3:Y151)","v":0},{"$f":"SUM(Z$3:Z151)","v":0},{"$f":"SUM(AA$3:AA151)","v":0},{"$f":"SUM(AB$3:AB151)","v":0},{"$f":"SUM(W$3:W151)","v":0},{"$f":"SUM(X$3:X151)","v":0},{"$f":"SUM(Y$3:Y151)","v":0},{"$f":"SUM(Z$3:Z151)","v":0},{"$f":"SUM(AA$3:AA151)","v":0},{"$f":"SUM(AB$3:AB151)","v":0}]
[17,"Mi 20:30",6,null,null,null,null,null,null,null,null,null,null,null,null,null,null,null,null,null,null,null,null,null,null,null,null,null,{"$f":"SUM(W$3:W152)","v":0},{"$f":"SUM(X$3:X152)","v":0},{"$f":"SUM(Y$3:Y152)","v":0},{"$f":"SUM(Z$3:Z152)","v":0},{"$f":"SUM(AA$3:AA152)","v":0},{"$f":"SUM(AB$3:AB152)","v":0},{"$f":"SUM(W$3:W152)","v":0},{"$f":"SUM(X$3:X152)","v":0},{"$f":"SUM(Y$3:Y152)","v":0},{"$f":"SUM(Z$3:Z152)","v":0},{"$f":"SUM(AA$3:AA152)","v":0},{"$f":"SUM(AB$3:AB152)","v":0}]
[17,"Mi 20:30",7,null,null,null,null,null,null,null,null,null,null,null,null,null,null,null,null,null,null,null,null,null,null,null,null,null,{"$f":"SUM(W$3:W153)","v":0},{"$f":"SUM(X$3:X153)","v":0},{"$f":"SUM(Y$3:Y153)","v":0},{"$f":"SUM(Z$3:Z153)","v":0},{"$f":"SUM(AA$3:AA153)","v":0},{"$f":"SUM(AB$3:AB153)","v":0},{"$f":"SUM(W$3:W153)","v":0},{"$f":"SUM(X$3:X153)","v":0},{"$f":"SUM(Y$3:Y153)","v":0},{"$f":"SUM(Z$3:Z153)","v":0},{"$f":"SUM(AA$3:AA153)","v":0},{"$f":"SUM(AB$3:AB153)","v":0}]
[17,"Mi 20:30",8,null,null,null,null,null,null,null,null,null,null,null,null,null,null,null,null,null,null,null,null,null,null,null,null,null,{"$f":"SUM(W$3:W154)","v":0},{"$f":"SUM(X$3:X154)","v":0},{"$f":"SUM(Y$3:Y154)","v":0},{"$f":"SUM(Z$3:Z154)","v":0},{"$f":"SUM(AA$3:AA154)","v":0},{"$f":"SUM(AB$3:AB154)","v":0},{"$f":"SUM(W$3:W154)","v":0},{"$f":"SUM(X$3:X154)","v":0},{"$f":"SUM(Y$3:Y154)","v":0},{"$f":"SUM(Z$3:Z154)","v":0},{"$f":"SUM(AA$3:AA154)","v":0},{"$f":"SUM(AB$3:AB154)","v":0}]
[17,"Do 20:30",9,null,null,null,null,null,null,null,null,null,null,null,null,null,null,null,null,null,null,null,null,null,null,null,null,null,{"$f":"SUM(W$3:W155)","v":0},{"$f":"SUM(X$3:X155)","v":0},{"$f":"SUM(Y$3:Y155)","v":0},{"$f":"SUM(Z$3:Z155)","v":0},{"$f":"SUM(AA$3:AA155)","v":0},{"$f":"SUM(AB$3:AB155)","v":0},{"$f":"SUM(W$3:W155)","v":0},{"$f":"SUM(X$3:X155)","v":0},{"$f":"SUM(Y$3:Y155)","v":0},{"$f":"SUM(Z$3:Z155)","v":0},{"$f":"SUM(AA$3:AA155)","v":0},{"$f":"SUM(AB$3:AB155)","v":0}]
[18,"Fr 20:30",1,null,null,null,null,null,null,null,null,null,null,null,null,null,null,null,null,null,null,null,null,null,null,null,null,null,{"$f":"SUM(W$156:W156)","v":0},{"$f":"SUM(X$156:X156)","v":0},{"$f":"SUM(Y$156:Y156)","v":0},{"$f":"SUM(Z$156:Z156)","v":0},{"$f":"SUM(AA$156:AA156)","v":0},{"$f":"SUM(AB$156:AB156)","v":0},{"$f":"SUM(W$3:W156)","v":0},{"$f":"SUM(X$3:X156)","v":0},{"$f":"SUM(Y$3:Y156)","v":0},{"$f":"SUM(Z$3:Z156)","v":0},{"$f":"SUM(AA$3:AA156)","v":0},{"$f":"SUM(AB$3:AB156)","v":0}]
[18,"Sa 15:30",2,null,null,null,null,null,null,null,null,null,null,null,null,null,null,null,null,null,null,null,null,null,null,null,null,null,{"$f":"SUM(W$156:W157)","v":0},{"$f":"SUM(X$156:X157)","v":0},{"$f":"SUM(Y$156:Y157)","v":0},{"$f":"SUM(Z$156:Z157)","v":0},{"$f":"SUM(AA$156:AA157)","v":0},{"$f":"SUM(AB$156:AB157)","v":0},{"$f":"SUM(W$3:W157)","v":0},{"$f":"SUM(X$3:X157)","v":0},{"$f":"SUM(Y$3:Y157)","v":0},{"$f":"SUM(Z$3:Z157)","v":0},{"$f":"SUM(AA$3:AA157)","v":0},{"$f":"SUM(AB$3:AB157)","v":0}]
[18,"Sa 15:30",3,null,null,null,null,null,null,null,null,null,null,null,null,null,null,null,null,null,null,null,null,null,null,null,null,null,{"$f":"SUM(W$156:W158)","v":0},{"$f":"SUM(X$156:X158)","v":0},{"$f":"SUM(Y$156:Y158)","v":0},{"$f":"SUM(Z$156:Z158)","v":0},{"$f":"SUM(AA$156:AA158)","v":0},{"$f":"SUM(AB$156:AB158)","v":0},{"$f":"SUM(W$3:W158)","v":0},{"$f":"SUM(X$3:X158)","v":0},{"$f":"SUM(Y$3:Y158)","v":0},{"$f":"SUM(Z$3:Z158)","v":0},{"$f":"SUM(AA$3:AA158)","v":0},{"$f":"SUM(AB$3:AB158)","v":0}]
[18,"Sa 15:30",4,null,null,null,null,null,null,null,null,null,null,null,null,null,null,null,null,null,null,null,null,null,null,null,null,null,{"$f":"SUM(W$156:W159)","v":0},{"$f":"SUM(X$156:X159)","v":0},{"$f":"SUM(Y$156:Y159)","v":0},{"$f":"SUM(Z$156:Z159)","v":0},{"$f":"SUM(AA$156:AA159)","v":0},{"$f":"SUM(AB$156:AB159)","v":0},{"$f":"SUM(W$3:W159)","v":0},{"$f":"SUM(X$3:X159)","v":0},{"$f":"SUM(Y$3:Y159)","v":0},{"$f":"SUM(Z$3:Z159)","v":0},{"$f":"SUM(AA$3:AA159)","v":0},{"$f":"SUM(AB$3:AB159)","v":0}]
[18,"Sa 15:30",5,null,null,null,null,null,null,null,null,null,null,null,null,null,null,null,null,null,null,null,null,null,null,null,null,null,{"$f":"SUM(W$156:W160)","v":0},{"$f":"SUM(X$156:X160)","v":0},{"$f":"SUM(Y$156:Y160)","v":0},{"$f":"SUM(Z$156:Z160)","v":0},{"$f":"SUM(AA$156:AA160)","v":0},{"$f":"SUM(AB$156:AB160)","v":0},{"$f":"SUM(W$3:W160)","v":0},{"$f":"SUM(X$3:X160)","v":0},{"$f":"SUM(Y$3:Y160)","v":0},{"$f":"SUM(Z$3:Z160)","v":0},{"$f":"SUM(AA$3:AA160)","v":0},{"$f":"SUM(AB$3:AB160)","v":0}]
[18,"Sa 15:30",6,null,null,null,null,null,null,null,null,null,null,null,null,null,null,null,null,null,null,null,null,null,null,null,null,null,{"$f":"SUM(W$156:W161)","v":0},{"$f":"SUM(X$156:X161)","v":0},{"$f":"SUM(Y$156:Y161)","v":0},{"$f":"SUM(Z$156:Z161)","v":0},{"$f":"SUM(AA$156:AA161)","v":0},{"$f":"SUM(AB$156:AB161)","v":0},{"$f":"SUM(W$3:W161)","v":0},{"$f":"SUM(X$3:X161)","v":0},{"$f":"SUM(Y$3:Y161)","v":0},{"$f":"SUM(Z$3:Z161)","v":0},{"$f":"SUM(AA$3:AA161)","v":0},{"$f":"SUM(AB$3:AB161)","v":0}]
[18,"Sa 18:30",7,null,null,null,null,null,null,null,null,null,null,null,null,null,null,null,null,null,null,null,null,null,null,null,null,null,{"$f":"SUM(W$156:W162)","v":0},{"$f":"SUM(X$156:X162)","v":0},{"$f":"SUM(Y$156:Y162)","v":0},{"$f":"SUM(Z$156:Z162)","v":0},{"$f":"SUM(AA$156:AA162)","v":0},{"$f":"SUM(AB$156:AB162)","v":0},{"$f":"SUM(W$3:W162)","v":0},{"$f":"SUM(X$3:X162)","v":0},{"$f":"SUM(Y$3:Y162)","v":0},{"$f":"SUM(Z$3:Z162)","v":0},{"$f":"SUM(AA$3:AA162)","v":0},{"$f":"SUM(AB$3:AB162)","v":0}]
[18,"So 15:30",8,null,null,null,null,null,null,null,null,null,null,null,null,null,null,null,null,null,null,null,null,null,null,null,null,null,{"$f":"SUM(W$156:W163)","v":0},{"$f":"SUM(X$156:X163)","v":0},{"$f":"SUM(Y$156:Y163)","v":0},{"$f":"SUM(Z$156:Z163)","v":0},{"$f":"SUM(AA$156:AA163)","v":0},{"$f":"SUM(AB$156:AB163)","v":0},{"$f":"SUM(W$3:W163)","v":0},{"$f":"SUM(X$3:X163)","v":0},{"$f":"SUM(Y$3:Y163)","v":0},{"$f":"SUM(Z$3:Z163)","v":0},{"$f":"SUM(AA$3:AA163)","v":0},{"$f":"SUM(AB$3:AB163)","v":0}]
[18,"So 17:30",9,null,null,null,null,null,null,null,null,null,null,null,null,null,null,null,null,null,null,null,null,null,null,null,null,null,{"$f":"SUM(W$156:W164)","v":0},{"$f":"SUM(X$156:X164)","v":0},{"$f":"SUM(Y$156:Y164)","v":0},{"$f":"SUM(Z$156:Z164)","v":0},{"$f":"SUM(AA$156:AA164)","v":0},{"$f":"SUM(AB$156:AB164)","v":0},{"$f":"SUM(W$3:W164)","v":0},{"$f":"SUM(X$3:X164)","v":0},{"$f":"SUM(Y$3:Y164)","v":0},{"$f":"SUM(Z$3:Z164)","v":0},{"$f":"SUM(AA$3:AA164)","v":0},{"$f":"SUM(AB$3:AB164)","v":0}]
[19,"Fr 20:30",1,null,null,null,null,null,null,null,null,null,null,null,null,null,null,null,null,null,null,null,null,null,null,null,null,null,{"$f":"SUM(W$156:W165)","v":0},{"$f":"SUM(X$156:X165)","v":0},{"$f":"SUM(Y$156:Y165)","v":0},{"$f":"SUM(Z$156:Z165)","v":0},{"$f":"SUM(AA$156:AA165)","v":0},{"$f":"SUM(AB$156:AB165)","v":0},{"$f":"SUM(W$3:W165)","v":0},{"$f":"SUM(X$3:X165)","v":0},{"$f":"SUM(Y$3:Y165)","v":0},{"$f":"SUM(Z$3:Z165)","v":0},{"$f":"SUM(AA$3:AA165)","v":0},{"$f":"SUM(AB$3:AB165)","v":0}]
[19,"Sa 15:30",2,null,null,null,null,null,null,null,null,null,null,null,null,null,null,null,null,null,null,null,null,null,null,null,null,null,{"$f":"SUM(W$156:W166)","v":0},{"$f":"SUM(X$156:X166)","v":0},{"$f":"SUM(Y$156:Y166)","v":0},{"$f":"SUM(Z$156:Z166)","v":0},{"$f":"SUM(AA$156:AA166)","v":0},{"$f":"SUM(AB$156:AB166)","v":0},{"$f":"SUM(W$3:W166)","v":0},{"$f":"SUM(X$3:X166)","v":0},{"$f":"SUM(Y$3:Y166)","v":0},{"$f":"SUM(Z$3:Z166)","v":0},{"$f":"SUM(AA$3:AA166)","v":0},{"$f":"SUM(AB$3:AB166)","v":0}]
[19,"Sa 15:30",3,null,null,null,null,null,null,null,null,null,null,null,null,null,null,null,null,null,null,null,null,null,null,null,null,null,{"$f":"SUM(W$156:W167)","v":0},{"$f":"SUM(X$156:X167)","v":0},{"$f":"SUM(Y$156:Y167)","v":0},{"$f":"SUM(Z$156:Z167)","v":0},{"$f":"SUM(AA$156:AA167)","v":0},{"$f":"SUM(AB$156:AB167)","v":0},{"$f":"SUM(W$3:W167)","v":0},{"$f":"SUM(X$3:X167)","v":0},{"$f":"SUM(Y$3:Y167)","v":0},{"$f":"SUM(Z$3:Z167)","v":0},{"$f":"SUM(AA$3:AA167)","v":0},{"$f":"SUM(AB$3:AB167)","v":0}]
[19,"Sa 15:30",4,null,null,null,null,null,null,null,null,null,null,null,null,null,null,null,null,null,null,null,null,null,null,null,null,null,{"$f":"SUM(W$156:W168)","v":0},{"$f":"SUM(X$156:X168)","v":0},{"$f":"SUM(Y$156:Y168)","v":0},{"$f":"SUM(Z$156:Z168)","v":0},{"$f":"SUM(AA$156:AA168)","v":0},{"$f":"SUM(AB$156:AB168)","v":0},{"$f":"SUM(W$3:W168)","v":0},{"$f":"SUM(X$3:X168)","v":0},{"$f":"SUM(Y$3:Y168)","v":0},{"$f":"SUM(Z$3:Z168)","v":0},{"$f":"SUM(AA$3:AA168)","v":0},{"$f":"SUM(AB$3:AB168)","v":0}]
[19,"Sa 15:30",5,null,null,null,null,null,null,null,null,null,null,null,null,null,null,null,null,null,null,null,null,null,null,null,null,null,{"$f":"SUM(W$156:W169)","v":0},{"$f":"SUM(X$156:X169)","v":0},{"$f":"SUM(Y$156:Y169)","v":0},{"$f":"SUM(Z$156:Z169)","v":0},{"$f":"SUM(AA$156:AA169)","v":0},{"$f":"SUM(AB$156:AB169)","v":0},{"$f":"SUM(W$3:W169)","v":0},{"$f":"SUM(X$3:X169)","v":0},{"$f":"SUM(Y$3:Y169)","v":0},{"$f":"SUM(Z$3:Z169)","v":0},{"$f":"SUM(AA$3:AA169)","v":0},{"$f":"SUM(AB$3:AB169)","v":0}]
[19,"Sa 15:30",6,null,null,null,null,null,null,null,null,null,null,null,null,null,null,null,null,null,null,null,null,null,null,null,null,null,{"$f":"SUM(W$156:W170)","v":0},{"$f":"SUM(X$156:X170)","v":0},{"$f":"SUM(Y$156:Y170)","v":0},{"$f":"SUM(Z$156:Z170)","v":0},{"$f":"SUM(AA$156:AA170)","v":0},{"$f":"SUM(AB$156:AB170)","v":0},{"$f":"SUM(W$3:W170)","v":0},{"$f":"SUM(X$3:X170)","v":0},{"$f":"SUM(Y$3:Y170)","v":0},{"$f":"SUM(Z$3:Z170)","v":0},{"$f":"SUM(AA$3:AA170)","v":0},{"$f":"SUM(AB$3:AB170)","v":0}]
[19,"Sa 18:30",7,null,null,null,null,null,null,null,null,null,null,null,null,null,null,null,null,null,null,null,null,null,null,null,null,null,{"$f":"SUM(W$156:W171)","v":0},{"$f":"SUM(X$156:X171)","v":0},{"$f":"SUM(Y$156:Y171)","v":0},{"$f":"SUM(Z$156:Z171)","v":0},{"$f":"SUM(AA$156:AA171)","v":0},{"$f":"SUM(AB$156:AB171)","v":0},{"$f":"SUM(W$3:W171)","v":0},{"$f":"SUM(X$3:X171)","v":0},{"$f":"SUM(Y$3:Y171)","v":0},{"$f":"SUM(Z$3:Z171)","v":0},{"$f":"SUM(AA$3:AA171)","v":0},{"$f":"SUM(AB$3:AB171)","v":0}]
[19,"So 15:30",8,null,null,null,null,null,null,null,null,null,null,null,null,null,null,null,null,null,null,null,null,null,null,null,null,null,{"$f":"SUM(W$156:W172)","v":0},{"$f":"SUM(X$156:X172)","v":0},{"$f":"SUM(Y$156:Y172)","v":0},{"$f":"SUM(Z$156:Z172)","v":0},{"$f":"SUM(AA$156:AA172)","v":0},{"$f":"SUM(AB$156:AB172)","v":0},{"$f":"SUM(W$3:W172)","v":0},{"$f":"SUM(X$3:X172)","v":0},{"$f":"SUM(Y$3:Y172)","v":0},{"$f":"SUM(Z$3:Z172)","v":0},{"$f":"SUM(AA$3:AA172)","v":0},{"$f":"SUM(AB$3:AB172)","v":0}]
[19,"So 17:30",9,null,null,null,null,null,null,null,null,null,null,null,null,null,null,null,null,null,null,null,null,null,null,null,null,null,{"$f":"SUM(W$156:W173)","v":0},{"$f":"SUM(X$156:X173)","v":0},{"$f":"SUM(Y$156:Y173)","v":0},{"$f":"SUM(Z$156:Z173)","v":0},{"$f":"SUM(AA$156:AA173)","v":0},{"$f":"SUM(AB$156:AB173)","v":0},{"$f":"SUM(W$3:W173)","v":0},{"$f":"SUM(X$3:X173)","v":0},{"$f":"SUM(Y$3:Y173)","v":0},{"$f":"SUM(Z$3:Z173)","v":0},{"$f":"SUM(AA$3:AA173)","v":0},{"$f":"SUM(AB$3:AB173)","v":0}]
[20,"Fr 20:30",1,null,null,null,null,null,null,null,null,null,null,null,null,null,null,null,null,null,null,null,null,null,null,null,null,null,{"$f":"SUM(W$156:W174)","v":0},{"$f":"SUM(X$156:X174)","v":0},{"$f":"SUM(Y$156:Y174)","v":0},{"$f":"SUM(Z$156:Z174)","v":0},{"$f":"SUM(AA$156:AA174)","v":0},{"$f":"SUM(AB$156:AB174)","v":0},{"$f":"SUM(W$3:W174)","v":0},{"$f":"SUM(X$3:X174)","v":0},{"$f":"SUM(Y$3:Y174)","v":0},{"$f":"SUM(Z$3:Z174)","v":0},{"$f":"SUM(AA$3:AA174)","v":0},{"$f":"SUM(AB$3:AB174)","v":0}]
[20,"Sa 15:30",2,null,null,null,null,null,null,null,null,null,null,null,null,null,null,null,null,null,null,null,null,null,null,null,null,null,{"$f":"SUM(W$156:W175)","v":0},{"$f":"SUM(X$156:X175)","v":0},{"$f":"SUM(Y$156:Y175)","v":0},{"$f":"SUM(Z$156:Z175)","v":0},{"$f":"SUM(AA$156:AA175)","v":0},{"$f":"SUM(AB$156:AB175)","v":0},{"$f":"SUM(W$3:W175)","v":0},{"$f":"SUM(X$3:X175)","v":0},{"$f":"SUM(Y$3:Y175)","v":0},{"$f":"SUM(Z$3:Z175)","v":0},{"$f":"SUM(AA$3:AA175)","v":0},{"$f":"SUM(AB$3:AB175)","v":0}]
[20,"Sa 15:30",3,null,null,null,null,null,null,null,null,null,null,null,null,null,null,null,null,null,null,null,null,null,null,null,null,null,{"$f":"SUM(W$156:W176)","v":0},{"$f":"SUM(X$156:X176)","v":0},{"$f":"SUM(Y$156:Y176)","v":0},{"$f":"SUM(Z$156:Z176)","v":0},{"$f":"SUM(AA$156:AA176)","v":0},{"$f":"SUM(AB$156:AB176)","v":0},{"$f":"SUM(W$3:W176)","v":0},{"$f":"SUM(X$3:X176)","v":0},{"$f":"SUM(Y$3:Y176)","v":0},{"$f":"SUM(Z$3:Z176)","v":0},{"$f":"SUM(AA$3:AA176)","v":0},{"$f":"SUM(AB$3:AB176)","v":0}]
[20,"Sa 15:30",4,null,null,null,null,null,null,null,null,null,null,null,null,null,null,null,null,null,null,null,null,null,null,null,null,null,{"$f":"SUM(W$156:W177)","v":0},{"$f":"SUM(X$156:X177)","v":0},{"$f":"SUM(Y$156:Y177)","v":0},{"$f":"SUM(Z$156:Z177)","v":0},{"$f":"SUM(AA$156:AA177)","v":0},{"$f":"SUM(AB$156:AB177)","v":0},{"$f":"SUM(W$3:W177)","v":0},{"$f":"SUM(X$3:X177)","v":0},{"$f":"SUM(Y$3:Y177)","v":0},{"$f":"SUM(Z$3:Z177)","v":0},{"$f":"SUM(AA$3:AA177)","v":0},{"$f":"SUM(AB$3:AB177)","v":0}]
[20,"Sa 15:30",5,null,null,null,null,null,null,null,null,null,null,null,null,null,null,null,null,null,null,null,null,null,null,null,null,null,{"$f":"SUM(W$156:W178)","v":0},{"$f":"SUM(X$156:X178)","v":0},{"$f":"SUM(Y$156:Y178)","v":0},{"$f":"SUM(Z$156:Z178)","v":0},{"$f":"SUM(AA$156:AA178)","v":0},{"$f":"SUM(AB$156:AB178)","v":0},{"$f":"SUM(W$3:W178)","v":0},{"$f":"SUM(X$3:X178)","v":0},{"$f":"SUM(Y$3:Y178)","v":0},{"$f":"SUM(Z$3:Z178)","v":0},{"$f":"SUM(AA$3:AA178)","v":0},{"$f":"SUM(AB$3:AB178)","v":0}]
[20,"Sa 15:30",6,null,null,null,null,null,null,null,null,null,null,null,null,null,null,null,null,null,null,null,null,null,null,null,null,null,{"$f":"SUM(W$156:W179)","v":0},{"$f":"SUM(X$156:X179)","v":0},{"$f":"SUM(Y$156:Y179)","v":0},{"$f":"SUM(Z$156:Z179)","v":0},{"$f":"SUM(AA$156:AA179)","v":0},{"$f":"SUM(AB$156:AB179)","v":0},{"$f":"SUM(W$3:W179)","v":0},{"$f":"SUM(X$3:X179)","v":0},{"$f":"SUM(Y$3:Y179)","v":0},{"$f":"SUM(Z$3:Z179)","v":0},{"$f":"SUM(AA$3:AA179)","v":0},{"$f":"SUM(AB$3:AB179)","v":0}]
[20,"Sa 18:30",7,null,null,null,null,null,null,null,null,null,null,null,null,null,null,null,null,null,null,null,null,null,null,null,null,null,{"$f":"SUM(W$156:W180)","v":0},{"$f":"SUM(X$156:X180)","v":0},{"$f":"SUM(Y$156:Y180)","v":0},{"$f":"SUM(Z$156:Z180)","v":0},{"$f":"SUM(AA$156:AA180)","v":0},{"$f":"SUM(AB$156:AB180)","v":0},{"$f":"SUM(W$3:W180)","v":0},{"$f":"SUM(X$3:X180)","v":0},{"$f":"SUM(Y$3:Y180)","v":0},{"$f":"SUM(Z$3:Z180)","v":0},{"$f":"SUM(AA$3:AA180)","v":0},{"$f":"SUM(AB$3:AB180)","v":0}]
[20,"So 15:30",8,null,null,null,null,null,null,null,null,null,null,null,null,null,null,null,null,null,null,null,null,null,null,null,null,null,{"$f":"SUM(W$156:W181)","v":0},{"$f":"SUM(X$156:X181)","v":0},{"$f":"SUM(Y$156:Y181)","v":0},{"$f":"SUM(Z$156:Z181)","v":0},{"$f":"SUM(AA$156:AA181)","v":0},{"$f":"SUM(AB$156:AB181)","v":0},{"$f":"SUM(W$3:W181)","v":0},{"$f":"SUM(X$3:X181)","v":0},{"$f":"SUM(Y$3:Y181)","v":0},{"$f":"SUM(Z$3:Z181)","v":0},{"$f":"SUM(AA$3:AA181)","v":0},{"$f":"SUM(AB$3:AB181)","v":0}]
[20,"So 17:30",9,null,null,null,null,null,null,null,null,null,null,null,null,null,null,null,null,null,null,null,null,null,null,null,null,null,{"$f":"SUM(W$156:W182)","v":0},{"$f":"SUM(X$156:X182)","v":0},{"$f":"SUM(Y$156:Y182)","v":0},{"$f":"SUM(Z$156:Z182)","v":0},{"$f":"SUM(AA$156:AA182)","v":0},{"$f":"SUM(AB$156:AB182)","v":0},{"$f":"SUM(W$3:W182)","v":0},{"$f":"SUM(X$3:X182)","v":0},{"$f":"SUM(Y$3:Y182)","v":0},{"$f":"SUM(Z$3:Z182)","v":0},{"$f":"SUM(AA$3:AA182)","v":0},{"$f":"SUM(AB$3:AB182)","v":0}]
[21,"Fr 20:30",1,null,null,null,null,null,null,null,null,null,null,null,null,null,null,null,null,null,null,null,null,null,null,null,null,null,{"$f":"SUM(W$156:W183)","v":0},{"$f":"SUM(X$156:X183)","v":0},{"$f":"SUM(Y$156:Y183)","v":0},{"$f":"SUM(Z$156:Z183)","v":0},{"$f":"SUM(AA$156:AA183)","v":0},{"$f":"SUM(AB$156:AB183)","v":0},{"$f":"SUM(W$3:W183)","v":0},{"$f":"SUM(X$3:X183)","v":0},{"$f":"SUM(Y$3:Y183)","v":0},{"$f":"SUM(Z$3:Z183)","v":0},{"$f":"SUM(AA$3:AA183)","v":0},{"$f":"SUM(AB$3:AB183)","v":0}]
[21,"Sa 15:30",2,null,null,null,null,null,null,null,null,null,null,null,null,null,null,null,null,null,null,null,null,null,null,null,null,null,{"$f":"SUM(W$156:W184)","v":0},{"$f":"SUM(X$156:X184)","v":0},{"$f":"SUM(Y$156:Y184)","v":0},{"$f":"SUM(Z$156:Z184)","v":0},{"$f":"SUM(AA$156:AA184)","v":0},{"$f":"SUM(AB$156:AB184)","v":0},{"$f":"SUM(W$3:W184)","v":0},{"$f":"SUM(X$3:X184)","v":0},{"$f":"SUM(Y$3:Y184)","v":0},{"$f":"SUM(Z$3:Z184)","v":0},{"$f":"SUM(AA$3:AA184)","v":0},{"$f":"SUM(AB$3:AB184)","v":0}]
[21,"Sa 15:30",3,null,null,null,null,null,null,null,null,null,null,null,null,null,null,null,null,null,null,null,null,null,null,null,null,null,{"$f":"SUM(W$156:W185)","v":0},{"$f":"SUM(X$156:X185)","v":0},{"$f":"SUM(Y$156:Y185)","v":0},{"$f":"SUM(Z$156:Z185)","v":0},{"$f":"SUM(AA$156:AA185)","v":0},{"$f":"SUM(AB$156:AB185)","v":0},{"$f":"SUM(W$3:W185)","v":0},{"$f":"SUM(X$3:X185)","v":0},{"$f":"SUM(Y$3:Y185)","v":0},{"$f":"SUM(Z$3:Z185)","v":0},{"$f":"SUM(AA$3:AA185)","v":0},{"$f":"SUM(AB$3:AB185)","v":0}]
[21,"Sa 15:30",4,null,null,null,null,null,null,null,null,null,null,null,null,null,null,null,null,null,null,null,null,null,null,null,null,null,{"$f":"SUM(W$156:W186)","v":0},{"$f":"SUM(X$156:X186)","v":0},{"$f":"SUM(Y$156:Y186)","v":0},{"$f":"SUM(Z$156:Z186)","v":0},{"$f":"SUM(AA$156:AA186)","v":0},{"$f":"SUM(AB$156:AB186)","v":0},{"$f":"SUM(W$3:W186)","v":0},{"$f":"SUM(X$3:X186)","v":0},{"$f":"SUM(Y$3:Y186)","v":0},{"$f":"SUM(Z$3:Z186)","v":0},{"$f":"SUM(AA$3:AA186)","v":0},{"$f":"SUM(AB$3:AB186)","v":0}]
[21,"Sa 15:30",5,null,null,null,null,null,null,null,null,null,null,null,null,null,null,null,null,null,null,null,null,null,null,null,null,null,{"$f":"SUM(W$156:W187)","v":0},{"$f":"SUM(X$156:X187)","v":0},{"$f":"SUM(Y$156:Y187)","v":0},{"$f":"SUM(Z$156:Z187)","v":0},{"$f":"SUM(AA$156:AA187)","v":0},{"$f":"SUM(AB$156:AB187)","v":0},{"$f":"SUM(W$3:W187)","v":0},{"$f":"SUM(X$3:X187)","v":0},{"$f":"SUM(Y$3:Y187)","v":0},{"$f":"SUM(Z$3:Z187)","v":0},{"$f":"SUM(AA$3:AA187)","v":0},{"$f":"SUM(AB$3:AB187)","v":0}]
[21,"Sa 15:30",6,null,null,null,null,null,null,null,null,null,null,null,null,null,null,null,null,null,null,null,null,null,null,null,null,null,{"$f":"SUM(W$156:W188)","v":0},{"$f":"SUM(X$156:X188)","v":0},{"$f":"SUM(Y$156:Y188)","v":0},{"$f":"SUM(Z$156:Z188)","v":0},{"$f":"SUM(AA$156:AA188)","v":0},{"$f":"SUM(AB$156:AB188)","v":0},{"$f":"SUM(W$3:W188)","v":0},{"$f":"SUM(X$3:X188)","v":0},{"$f":"SUM(Y$3:Y188)","v":0},{"$f":"SUM(Z$3:Z188)","v":0},{"$f":"SUM(AA$3:AA188)","v":0},{"$f":"SUM(AB$3:AB188)","v":0}]
[21,"Sa 18:30",7,null,null,null,null,null,null,null,null,null,null,null,null,null,null,null,null,null,null,null,null,null,null,null,null,null,{"$f":"SUM(W$156:W189)","v":0},{"$f":"SUM(X$156:X189)","v":0},{"$f":"SUM(Y$156:Y189)","v":0},{"$f":"SUM(Z$156:Z189)","v":0},{"$f":"SUM(AA$156:AA189)","v":0},{"$f":"SUM(AB$156:AB189)","v":0},{"$f":"SUM(W$3:W189)","v":0},{"$f":"SUM(X$3:X189)","v":0},{"$f":"SUM(Y$3:Y189)","v":0},{"$f":"SUM(Z$3:Z189)","v":0},{"$f":"SUM(AA$3:AA189)","v":0},{"$f":"SUM(AB$3:AB189)","v":0}]
[21,"So 15:30",8,null,null,null,null,null,null,null,null,null,null,null,null,null,null,null,null,null,null,null,null,null,null,null,null,null,{"$f":"SUM(W$156:W190)","v":0},{"$f":"SUM(X$156:X190)","v":0},{"$f":"SUM(Y$156:Y190)","v":0},{"$f":"SUM(Z$156:Z190)","v":0},{"$f":"SUM(AA$156:AA190)","v":0},{"$f":"SUM(AB$156:AB190)","v":0},{"$f":"SUM(W$3:W190)","v":0},{"$f":"SUM(X$3:X190)","v":0},{"$f":"SUM(Y$3:Y190)","v":0},{"$f":"SUM(Z$3:Z190)","v":0},{"$f":"SUM(AA$3:AA190)","v":0},{"$f":"SUM(AB$3:AB190)","v":0}]
[21,"So 17:30",9,null,null,null,null,null,null,null,null,null,null,null,null,null,null,null,null,null,null,null,null,null,null,null,null,null,{"$f":"SUM(W$156:W191)","v":0},{"$f":"SUM(X$156:X191)","v":0},{"$f":"SUM(Y$156:Y191)","v":0},{"$f":"SUM(Z$156:Z191)","v":0},{"$f":"SUM(AA$156:AA191)","v":0},{"$f":"SUM(AB$156:AB191)","v":0},{"$f":"SUM(W$3:W191)","v":0},{"$f":"SUM(X$3:X191)","v":0},{"$f":"SUM(Y$3:Y191)","v":0},{"$f":"SUM(Z$3:Z191)","v":0},{"$f":"SUM(AA$3:AA191)","v":0},{"$f":"SUM(AB$3:AB191)","v":0}]
[22,"Fr 20:30",1,null,null,null,null,null,null,null,null,null,null,null,null,null,null,null,null,null,null,null,null,null,null,null,null,null,{"$f":"SUM(W$156:W192)","v":0},{"$f":"SUM(X$156:X192)","v":0},{"$f":"SUM(Y$156:Y192)","v":0},{"$f":"SUM(Z$156:Z192)","v":0},{"$f":"SUM(AA$156:AA192)","v":0},{"$f":"SUM(AB$156:AB192)","v":0},{"$f":"SUM(W$3:W192)","v":0},{"$f":"SUM(X$3:X192)","v":0},{"$f":"SUM(Y$3:Y192)","v":0},{"$f":"SUM(Z$3:Z192)","v":0},{"$f":"SUM(AA$3:AA192)","v":0},{"$f":"SUM(AB$3:AB192)","v":0}]
[22,"Sa 15:30",2,null,null,null,null,null,null,null,null,null,null,null,null,null,null,null,null,null,null,null,null,null,null,null,null,null,{"$f":"SUM(W$156:W193)","v":0},{"$f":"SUM(X$156:X193)","v":0},{"$f":"SUM(Y$156:Y193)","v":0},{"$f":"SUM(Z$156:Z193)","v":0},{"$f":"SUM(AA$156:AA193)","v":0},{"$f":"SUM(AB$156:AB193)","v":0},{"$f":"SUM(W$3:W193)","v":0},{"$f":"SUM(X$3:X193)","v":0},{"$f":"SUM(Y$3:Y193)","v":0},{"$f":"SUM(Z$3:Z193)","v":0},{"$f":"SUM(AA$3:AA193)","v":0},{"$f":"SUM(AB$3:AB193)","v":0}]
[22,"Sa 15:30",3,null,null,null,null,null,null,null,null,null,null,null,null,null,null,null,null,null,null,null,null,null,null,null,null,null,{"$f":"SUM(W$156:W194)","v":0},{"$f":"SUM(X$156:X194)","v":0},{"$f":"SUM(Y$156:Y194)","v":0},{"$f":"SUM(Z$156:Z194)","v":0},{"$f":"SUM(AA$156:AA194)","v":0},{"$f":"SUM(AB$156:AB194)","v":0},{"$f":"SUM(W$3:W194)","v":0},{"$f":"SUM(X$3:X194)","v":0},{"$f":"SUM(Y$3:Y194)","v":0},{"$f":"SUM(Z$3:Z194)","v":0},{"$f":"SUM(AA$3:AA194)","v":0},{"$f":"SUM(AB$3:AB194)","v":0}]
[22,"Sa 15:30",4,null,null,null,null,null,null,null,null,null,null,null,null,null,null,null,null,null,null,null,null,null,null,null,null,null,{"$f":"SUM(W$156:W195)","v":0},{"$f":"SUM(X$156:X195)","v":0},{"$f":"SUM(Y$156:Y195)","v":0},{"$f":"SUM(Z$156:Z195)","v":0},{"$f":"SUM(AA$156:AA195)","v":0},{"$f":"SUM(AB$156:AB195)","v":0},{"$f":"SUM(W$3:W195)","v":0},{"$f":"SUM(X$3:X195)","v":0},{"$f":"SUM(Y$3:Y195)","v":0},{"$f":"SUM(Z$3:Z195)","v":0},{"$f":"SUM(AA$3:AA195)","v":0},{"$f":"SUM(AB$3:AB195)","v":0}]
[22,"Sa 15:30",5,null,null,null,null,null,null,null,null,null,null,null,null,null,null,null,null,null,null,null,null,null,null,null,null,null,{"$f":"SUM(W$156:W196)","v":0},{"$f":"SUM(X$156:X196)","v":0},{"$f":"SUM(Y$156:Y196)","v":0},{"$f":"SUM(Z$156:Z196)","v":0},{"$f":"SUM(AA$156:AA196)","v":0},{"$f":"SUM(AB$156:AB196)","v":0},{"$f":"SUM(W$3:W196)","v":0},{"$f":"SUM(X$3:X196)","v":0},{"$f":"SUM(Y$3:Y196)","v":0},{"$f":"SUM(Z$3:Z196)","v":0},{"$f":"SUM(AA$3:AA196)","v":0},{"$f":"SUM(AB$3:AB196)","v":0}]
[22,"Sa 15:30",6,null,null,null,null,null,null,null,null,null,null,null,null,null,null,null,null,null,null,null,null,null,null,null,null,null,{"$f":"SUM(W$156:W197)","v":0},{"$f":"SUM(X$156:X197)","v":0},{"$f":"SUM(Y$156:Y197)","v":0},{"$f":"SUM(Z$156:Z197)","v":0},{"$f":"SUM(AA$156:AA197)","v":0},{"$f":"SUM(AB$156:AB197)","v":0},{"$f":"SUM(W$3:W197)","v":0},{"$f":"SUM(X$3:X197)","v":0},{"$f":"SUM(Y$3:Y197)","v":0},{"$f":"SUM(Z$3:Z197)","v":0},{"$f":"SUM(AA$3:AA197)","v":0},{"$f":"SUM(AB$3:AB197)","v":0}]
[22,"Sa 18:30",7,null,null,null,null,null,null,null,null,null,null,null,null,null,null,null,null,null,null,null,null,null,null,null,null,null,{"$f":"SUM(W$156:W198)","v":0},{"$f":"SUM(X$156:X198)","v":0},{"$f":"SUM(Y$156:Y198)","v":0},{"$f":"SUM(Z$156:Z198)","v":0},{"$f":"SUM(AA$156:AA198)","v":0},{"$f":"SUM(AB$156:AB198)","v":0},{"$f":"SUM(W$3:W198)","v":0},{"$f":"SUM(X$3:X198)","v":0},{"$f":"SUM(Y$3:Y198)","v":0},{"$f":"SUM(Z$3:Z198)","v":0},{"$f":"SUM(AA$3:AA198)","v":0},{"$f":"SUM(AB$3:AB198)","v":0}]
[22,"So 15:30",8,null,null,null,null,null,null,null,null,null,null,null,null,null,null,null,null,null,null,null,null,null,null,null,null,null,{"$f":"SUM(W$156:W199)","v":0},{"$f":"SUM(X$156:X199)","v":0},{"$f":"SUM(Y$156:Y199)","v":0},{"$f":"SUM(Z$156:Z199)","v":0},{"$f":"SUM(AA$156:AA199)","v":0},{"$f":"SUM(AB$156:AB199)","v":0},{"$f":"SUM(W$3:W199)","v":0},{"$f":"SUM(X$3:X199)","v":0},{"$f":"SUM(Y$3:Y199)","v":0},{"$f":"SUM(Z$3:Z199)","v":0},{"$f":"SUM(AA$3:AA199)","v":0},{"$f":"SUM(AB$3:AB199)","v":0}]
[22,"So 17:30",9,null,null,null,null,null,null,null,null,null,null,null,null,null,null,null,null,null,null,null,null,null,null,null,null,null,{"$f":"SUM(W$156:W200)","v":0},{"$f":"SUM(X$156:X200)","v":0},{"$f":"SUM(Y$156:Y200)","v":0},{"$f":"SUM(Z$156:Z200)","v":0},{"$f":"SUM(AA$156:AA200)","v":0},{"$f":"SUM(AB$156:AB200)","v":0},{"$f":"SUM(W$3:W200)","v":0},{"$f":"SUM(X$3:X200)","v":0},{"$f":"SUM(Y$3:Y200)","v":0},{"$f":"SUM(Z$3:Z200)","v":0},{"$f":"SUM(AA$3:AA200)","v":0},{"$f":"SUM(AB$3:AB200)","v":0}]
[23,"Fr 20:30",1,null,null,null,null,null,null,null,null,null,null,null,null,null,null,null,null,null,null,null,null,null,null,null,null,null,{"$f":"SUM(W$156:W201)","v":0},{"$f":"SUM(X$156:X201)","v":0},{"$f":"SUM(Y$156:Y201)","v":0},{"$f":"SUM(Z$156:Z201)","v":0},{"$f":"SUM(AA$156:AA201)","v":0},{"$f":"SUM(AB$156:AB201)","v":0},{"$f":"SUM(W$3:W201)","v":0},{"$f":"SUM(X$3:X201)","v":0},{"$f":"SUM(Y$3:Y201)","v":0},{"$f":"SUM(Z$3:Z201)","v":0},{"$f":"SUM(AA$3:AA201)","v":0},{"$f":"SUM(AB$3:AB201)","v":0}]
[23,"Sa 15:30",2,null,null,null,null,null,null,null,null,null,null,null,null,null,null,null,null,null,null,null,null,null,null,null,null,null,{"$f":"SUM(W$156:W202)","v":0},{"$f":"SUM(X$156:X202)","v":0},{"$f":"SUM(Y$156:Y202)","v":0},{"$f":"SUM(Z$156:Z202)","v":0},{"$f":"SUM(AA$156:AA202)","v":0},{"$f":"SUM(AB$156:AB202)","v":0},{"$f":"SUM(W$3:W202)","v":0},{"$f":"SUM(X$3:X202)","v":0},{"$f":"SUM(Y$3:Y202)","v":0},{"$f":"SUM(Z$3:Z202)","v":0},{"$f":"SUM(AA$3:AA202)","v":0},{"$f":"SUM(AB$3:AB202)","v":0}]
[23,"Sa 15:30",3,null,null,null,null,null,null,null,null,null,null,null,null,null,null,null,null,null,null,null,null,null,null,null,null,null,{"$f":"SUM(W$156:W203)","v":0},{"$f":"SUM(X$156:X203)","v":0},{"$f":"SUM(Y$156:Y203)","v":0},{"$f":"SUM(Z$156:Z203)","v":0},{"$f":"SUM(AA$156:AA203)","v":0},{"$f":"SUM(AB$156:AB203)","v":0},{"$f":"SUM(W$3:W203)","v":0},{"$f":"SUM(X$3:X203)","v":0},{"$f":"SUM(Y$3:Y203)","v":0},{"$f":"SUM(Z$3:Z203)","v":0},{"$f":"SUM(AA$3:AA203)","v":0},{"$f":"SUM(AB$3:AB203)","v":0}]
[23,"Sa 15:30",4,null,null,null,null,null,null,null,null,null,null,null,null,null,null,null,null,null,null,null,null,null,null,null,null,null,{"$f":"SUM(W$156:W204)","v":0},{"$f":"SUM(X$156:X204)","v":0},{"$f":"SUM(Y$156:Y204)","v":0},{"$f":"SUM(Z$156:Z204)","v":0},{"$f":"SUM(AA$156:AA204)","v":0},{"$f":"SUM(AB$156:AB204)","v":0},{"$f":"SUM(W$3:W204)","v":0},{"$f":"SUM(X$3:X204)","v":0},{"$f":"SUM(Y$3:Y204)","v":0},{"$f":"SUM(Z$3:Z204)","v":0},{"$f":"SUM(AA$3:AA204)","v":0},{"$f":"SUM(AB$3:AB204)","v":0}]
[23,"Sa 15:30",5,null,null,null,null,null,null,null,null,null,null,null,null,null,null,null,null,null,null,null,null,null,null,null,null,null,{"$f":"SUM(W$156:W205)","v":0},{"$f":"SUM(X$156:X205)","v":0},{"$f":"SUM(Y$156:Y205)","v":0},{"$f":"SUM(Z$156:Z205)","v":0},{"$f":"SUM(AA$156:AA205)","v":0},{"$f":"SUM(AB$156:AB205)","v":0},{"$f":"SUM(W$3:W205)","v":0},{"$f":"SUM(X$3:X205)","v":0},{"$f":"SUM(Y$3:Y205)","v":0},{"$f":"SUM(Z$3:Z205)","v":0},{"$f":"SUM(AA$3:AA205)","v":0},{"$f":"SUM(AB$3:AB205)","v":0}]
[23,"Sa 18:30",6,null,null,null,null,null,null,null,null,null,null,null,null,null,null,null,null,null,null,null,null,null,null,null,null,null,{"$f":"SUM(W$156:W206)","v":0},{"$f":"SUM(X$156:X206)","v":0},{"$f":"SUM(Y$156:Y206)","v":0},{"$f":"SUM(Z$156:Z206)","v":0},{"$f":"SUM(AA$156:AA206)","v":0},{"$f":"SUM(AB$156:AB206)","v":0},{"$f":"SUM(W$3:W206)","v":0},{"$f":"SUM(X$3:X206)","v":0},{"$f":"SUM(Y$3:Y206)","v":0},{"$f":"SUM(Z$3:Z206)","v":0},{"$f":"SUM(AA$3:AA206)","v":0},{"$f":"SUM(AB$3:AB206)","v":0}]
[23,"So 15:30",7,null,null,null,null,null,null,null,null,null,null,null,null,null,null,null,null,null,null,null,null,null,null,null,null,null,{"$f":"SUM(W$156:W207)","v":0},{"$f":"SUM(X$156:X207)","v":0},{"$f":"SUM(Y$156:Y207)","v":0},{"$f":"SUM(Z$156:Z207)","v":0},{"$f":"SUM(AA$156:AA207)","v":0},{"$f":"SUM(AB$156:AB207)","v":0},{"$f":"SUM(W$3:W207)","v":0},{"$f":"SUM(X$3:X207)","v":0},{"$f":"SUM(Y$3:Y207)","v":0},{"$f":"SUM(Z$3:Z207)","v":0},{"$f":"SUM(AA$3:AA207)","v":0},{"$f":"SUM(AB$3:AB207)","v":0}]
[23,"So 17:30",8,null,null,null,null,null,null,null,null,null,null,null,null,null,null,null,null,null,null,null,null,null,null,null,null,null,{"$f":"SUM(W$156:W208)","v":0},{"$f":"SUM(X$156:X208)","v":0},{"$f":"SUM(Y$156:Y208)","v":0},{"$f":"SUM(Z$156:Z208)","v":0},{"$f":"SUM(AA$156:AA208)","v":0},{"$f":"SUM(AB$156:AB208)","v":0},{"$f":"SUM(W$3:W208)","v":0},{"$f":"SUM(X$3:X208)","v":0},{"$f":"SUM(Y$3:Y208)","v":0},{"$f":"SUM(Z$3:Z208)","v":0},{"$f":"SUM(AA$3:AA208)","v":0},{"$f":"SUM(AB$3:AB208)","v":0}]
[23,"So 19:30",9,null,null,null,null,null,null,null,null,null,null,null,null,null,null,null,null,null,null,null,null,null,null,null,null,null,{"$f":"SUM(W$156:W209)","v":0},{"$f":"SUM(X$156:X209)","v":0},{"$f":"SUM(Y$156:Y209)","v":0},{"$f":"SUM(Z$156:Z209)","v":0},{"$f":"SUM(AA$156:AA209)","v":0},{"$f":"SUM(AB$156:AB209)","v":0},{"$f":"SUM(W$3:W209)","v":0},{"$f":"SUM(X$3:X209)","v":0},{"$f":"SUM(Y$3:Y209)","v":0},{"$f":"SUM(Z$3:Z209)","v":0},{"$f":"SUM(AA$3:AA209)","v":0},{"$f":"SUM(AB$3:AB209)","v":0}]
[24,"Fr 20:30",1,null,null,null,null,null,null,null,null,null,null,null,null,null,null,null,null,null,null,null,null,null,null,null,null,null,{"$f":"SUM(W$156:W210)","v":0},{"$f":"SUM(X$156:X210)","v":0},{"$f":"SUM(Y$156:Y210)","v":0},{"$f":"SUM(Z$156:Z210)","v":0},{"$f":"SUM(AA$156:AA210)","v":0},{"$f":"SUM(AB$156:AB210)","v":0},{"$f":"SUM(W$3:W210)","v":0},{"$f":"SUM(X$3:X210)","v":0},{"$f":"SUM(Y$3:Y210)","v":0},{"$f":"SUM(Z$3:Z210)","v":0},{"$f":"SUM(AA$3:AA210)","v":0},{"$f":"SUM(AB$3:AB210)","v":0}]
[24,"Sa 15:30",2,null,null,null,null,null,null,null,null,null,null,null,null,null,null,null,null,null,null,null,null,null,null,null,null,null,{"$f":"SUM(W$156:W211)","v":0},{"$f":"SUM(X$156:X211)","v":0},{"$f":"SUM(Y$156:Y211)","v":0},{"$f":"SUM(Z$156:Z211)","v":0},{"$f":"SUM(AA$156:AA211)","v":0},{"$f":"SUM(AB$156:AB211)","v":0},{"$f":"SUM(W$3:W211)","v":0},{"$f":"SUM(X$3:X211)","v":0},{"$f":"SUM(Y$3:Y211)","v":0},{"$f":"SUM(Z$3:Z211)","v":0},{"$f":"SUM(AA$3:AA211)","v":0},{"$f":"SUM(AB$3:AB211)","v":0}]
[24,"Sa 15:30",3,null,null,null,null,null,null,null,null,null,null,null,null,null,null,null,null,null,null,null,null,null,null,null,null,null,{"$f":"SUM(W$156:W212)","v":0},{"$f":"SUM(X$156:X212)","v":0},{"$f":"SUM(Y$156:Y212)","v":0},{"$f":"SUM(Z$156:Z212)","v":0},{"$f":"SUM(AA$156:AA212)","v":0},{"$f":"SUM(AB$156:AB212)","v":0},{"$f":"SUM(W$3:W212)","v":0},{"$f":"SUM(X$3:X212)","v":0},{"$f":"SUM(Y$3:Y212)","v":0},{"$f":"SUM(Z$3:Z212)","v":0},{"$f":"SUM(AA$3:AA212)","v":0},{"$f":"SUM(AB$3:AB212)","v":0}]
[24,"Sa 15:30",4,null,null,null,null,null,null,null,null,null,null,null,null,null,null,null,null,null,null,null,null,null,null,null,null,null,{"$f":"SUM(W$156:W213)","v":0},{"$f":"SUM(X$156:X213)","v":0},{"$f":"SUM(Y$156:Y213)","v":0},{"$f":"SUM(Z$156:Z213)","v":0},{"$f":"SUM(AA$156:AA213)","v":0},{"$f":"SUM(AB$156:AB213)","v":0},{"$f":"SUM(W$3:W213)","v":0},{"$f":"SUM(X$3:X213)","v":0},{"$f":"SUM(Y$3:Y213)","v":0},{"$f":"SUM(Z$3:Z213)","v":0},{"$f":"SUM(AA$3:AA213)","v":0},{"$f":"SUM(AB$3:AB213)","v":0}]
[24,"Sa 15:30",5,null,null,null,null,null,null,null,null,null,null,null,null,null,null,null,null,null,null,null,null,null,null,null,null,null,{"$f":"SUM(W$156:W214)","v":0},{"$f":"SUM(X$156:X214)","v":0},{"$f":"SUM(Y$156:Y214)","v":0},{"$f":"SUM(Z$156:Z214)","v":0},{"$f":"SUM(AA$156:AA214)","v":0},{"$f":"SUM(AB$156:AB214)","v":0},{"$f":"SUM(W$3:W214)","v":0},{"$f":"SUM(X$3:X214)","v":0},{"$f":"SUM(Y$3:Y214)","v":0},{"$f":"SUM(Z$3:Z214)","v":0},{"$f":"SUM(AA$3:AA214)","v":0},{"$f":"SUM(AB$3:AB214)","v":0}]
[24,"Sa 18:30",6,null,null,null,null,null,null,null,null,null,null,null,null,null,null,null,null,null,null,null,null,null,null,null,null,null,{"$f":"SUM(W$156:W215)","v":0},{"$f":"SUM(X$156:X215)","v":0},{"$f":"SUM(Y$156:Y215)","v":0},{"$f":"SUM(Z$156:Z215)","v":0},{"$f":"SUM(AA$156:AA215)","v":0},{"$f":"SUM(AB$156:AB215)","v":0},{"$f":"SUM(W$3:W215)","v":0},{"$f":"SUM(X$3:X215)","v":0},{"$f":"SUM(Y$3:Y215)","v":0},{"$f":"SUM(Z$3:Z215)","v":0},{"$f":"SUM(AA$3:AA215)","v":0},{"$f":"SUM(AB$3:AB215)","v":0}]
[24,"So 15:30",7,null,null,null,null,null,null,null,null,null,null,null,null,null,null,null,null,null,null,null,null,null,null,null,null,null,{"$f":"SUM(W$156:W216)","v":0},{"$f":"SUM(X$156:X216)","v":0},{"$f":"SUM(Y$156:Y216)","v":0},{"$f":"SUM(Z$156:Z216)","v":0},{"$f":"SUM(AA$156:AA216)","v":0},{"$f":"SUM(AB$156:AB216)","v":0},{"$f":"SUM(W$3:W216)","v":0},{"$f":"SUM(X$3:X216)","v":0},{"$f":"SUM(Y$3:Y216)","v":0},{"$f":"SUM(Z$3:Z216)","v":0},{"$f":"SUM(AA$3:AA216)","v":0},{"$f":"SUM(AB$3:AB216)","v":0}]
[24,"So 17:30",8,null,null,null,null,null,null,null,null,null,null,null,null,null,null,null,null,null,null,null,null,null,null,null,null,null,{"$f":"SUM(W$156:W217)","v":0},{"$f":"SUM(X$156:X217)","v":0},{"$f":"SUM(Y$156:Y217)","v":0},{"$f":"SUM(Z$156:Z217)","v":0},{"$f":"SUM(AA$156:AA217)","v":0},{"$f":"SUM(AB$156:AB217)","v":0},{"$f":"SUM(W$3:W217)","v":0},{"$f":"SUM(X$3:X217)","v":0},{"$f":"SUM(Y$3:Y217)","v":0},{"$f":"SUM(Z$3:Z217)","v":0},{"$f":"SUM(AA$3:AA217)","v":0},{"$f":"SUM(AB$3:AB217)","v":0}]
[24,"So 19:30",9,null,null,null,null,null,null,null,null,null,null,null,null,null,null,null,null,null,null,null,null,null,null,null,null,null,{"$f":"SUM(W$156:W218)","v":0},{"$f":"SUM(X$156:X218)","v":0},{"$f":"SUM(Y$156:Y218)","v":0},{"$f":"SUM(Z$156:Z218)","v":0},{"$f":"SUM(AA$156:AA218)","v":0},{"$f":"SUM(AB$156:AB218)","v":0},{"$f":"SUM(W$3:W218)","v":0},{"$f":"SUM(X$3:X218)","v":0},{"$f":"SUM(Y$3:Y218)","v":0},{"$f":"SUM(Z$3:Z218)","v":0},{"$f":"SUM(AA$3:AA218)","v":0},{"$f":"SUM(AB$3:AB218)","v":0}]
[25,"Fr 20:30",1,null,null,null,null,null,null,null,null,null,null,null,null,null,null,null,null,null,null,null,null,null,null,null,null,null,{"$f":"SUM(W$156:W219)","v":0},{"$f":"SUM(X$156:X219)","v":0},{"$f":"SUM(Y$156:Y219)","v":0},{"$f":"SUM(Z$156:Z219)","v":0},{"$f":"SUM(AA$156:AA219)","v":0},{"$f":"SUM(AB$156:AB219)","v":0},{"$f":"SUM(W$3:W219)","v":0},{"$f":"SUM(X$3:X219)","v":0},{"$f":"SUM(Y$3:Y219)","v":0},{"$f":"SUM(Z$3:Z219)","v":0},{"$f":"SUM(AA$3:AA219)","v":0},{"$f":"SUM(AB$3:AB219)","v":0}]
[25,"Sa 15:30",2,null,null,null,null,null,null,null,null,null,null,null,null,null,null,null,null,null,null,null,null,null,null,null,null,null,{"$f":"SUM(W$156:W220)","v":0},{"$f":"SUM(X$156:X220)","v":0},{"$f":"SUM(Y$156:Y220)","v":0},{"$f":"SUM(Z$156:Z220)","v":0},{"$f":"SUM(AA$156:AA220)","v":0},{"$f":"SUM(AB$156:AB220)","v":0},{"$f":"SUM(W$3:W220)","v":0},{"$f":"SUM(X$3:X220)","v":0},{"$f":"SUM(Y$3:Y220)","v":0},{"$f":"SUM(Z$3:Z220)","v":0},{"$f":"SUM(AA$3:AA220)","v":0},{"$f":"SUM(AB$3:AB220)","v":0}]
[25,"Sa 15:30",3,null,null,null,null,null,null,null,null,null,null,null,null,null,null,null,null,null,null,null,null,null,null,null,null,null,{"$f":"SUM(W$156:W221)","v":0},{"$f":"SUM(X$156:X221)","v":0},{"$f":"SUM(Y$156:Y221)","v":0},{"$f":"SUM(Z$156:Z221)","v":0},{"$f":"SUM(AA$156:AA221)","v":0},{"$f":"SUM(AB$156:AB221)","v":0},{"$f":"SUM(W$3:W221)","v":0},{"$f":"SUM(X$3:X221)","v":0},{"$f":"SUM(Y$3:Y221)","v":0},{"$f":"SUM(Z$3:Z221)","v":0},{"$f":"SUM(AA$3:AA221)","v":0},{"$f":"SUM(AB$3:AB221)","v":0}]
[25,"Sa 15:30",4,null,null,null,null,null,null,null,null,null,null,null,null,null,null,null,null,null,null,null,null,null,null,null,null,null,{"$f":"SUM(W$156:W222)","v":0},{"$f":"SUM(X$156:X222)","v":0},{"$f":"SUM(Y$156:Y222)","v":0},{"$f":"SUM(Z$156:Z222)","v":0},{"$f":"SUM(AA$156:AA222)","v":0},{"$f":"SUM(AB$156:AB222)","v":0},{"$f":"SUM(W$3:W222)","v":0},{"$f":"SUM(X$3:X222)","v":0},{"$f":"SUM(Y$3:Y222)","v":0},{"$f":"SUM(Z$3:Z222)","v":0},{"$f":"SUM(AA$3:AA222)","v":0},{"$f":"SUM(AB$3:AB222)","v":0}]
[25,"Sa 15:30",5,null,null,null,null,null,null,null,null,null,null,null,null,null,null,null,null,null,null,null,null,null,null,null,null,null,{"$f":"SUM(W$156:W223)","v":0},{"$f":"SUM(X$156:X223)","v":0},{"$f":"SUM(Y$156:Y223)","v":0},{"$f":"SUM(Z$156:Z223)","v":0},{"$f":"SUM(AA$156:AA223)","v":0},{"$f":"SUM(AB$156:AB223)","v":0},{"$f":"SUM(W$3:W223)","v":0},{"$f":"SUM(X$3:X223)","v":0},{"$f":"SUM(Y$3:Y223)","v":0},{"$f":"SUM(Z$3:Z223)","v":0},{"$f":"SUM(AA$3:AA223)","v":0},{"$f":"SUM(AB$3:AB223)","v":0}]
[25,"Sa 15:30",6,null,null,null,null,null,null,null,null,null,null,null,null,null,null,null,null,null,null,null,null,null,null,null,null,null,{"$f":"SUM(W$156:W224)","v":0},{"$f":"SUM(X$156:X224)","v":0},{"$f":"SUM(Y$156:Y224)","v":0},{"$f":"SUM(Z$156:Z224)","v":0},{"$f":"SUM(AA$156:AA224)","v":0},{"$f":"SUM(AB$156:AB224)","v":0},{"$f":"SUM(W$3:W224)","v":0},{"$f":"SUM(X$3:X224)","v":0},{"$f":"SUM(Y$3:Y224)","v":0},{"$f":"SUM(Z$3:Z224)","v":0},{"$f":"SUM(AA$3:AA224)","v":0},{"$f":"SUM(AB$3:AB224)","v":0}]
[25,"Sa 18:30",7,null,null,null,null,null,null,null,null,null,null,null,null,null,null,null,null,null,null,null,null,null,null,null,null,null,{"$f":"SUM(W$156:W225)","v":0},{"$f":"SUM(X$156:X225)","v":0},{"$f":"SUM(Y$156:Y225)","v":0},{"$f":"SUM(Z$156:Z225)","v":0},{"$f":"SUM(AA$156:AA225)","v":0},{"$f":"SUM(AB$156:AB225)","v":0},{"$f":"SUM(W$3:W225)","v":0},{"$f":"SUM(X$3:X225)","v":0},{"$f":"SUM(Y$3:Y225)","v":0},{"$f":"SUM(Z$3:Z225)","v":0},{"$f":"SUM(AA$3:AA225)","v":0},{"$f":"SUM(AB$3:AB225)","v":0}]
[25,"So 15:30",8,null,null,null,null,null,null,null,null,null,null,null,null,null,null,null,null,null,null,null,null,null,null,null,null,null,{"$f":"SUM(W$156:W226)","v":0},{"$f":"SUM(X$156:X226)","v":0},{"$f":"SUM(Y$156:Y226)","v":0},{"$f":"SUM(Z$156:Z226)","v":0},{"$f":"SUM(AA$156:AA226)","v":0},{"$f":"SUM(AB$156:AB226)","v":0},{"$f":"SUM(W$3:W226)","v":0},{"$f":"SUM(X$3:X226)","v":0},{"$f":"SUM(Y$3:Y226)","v":0},{"$f":"SUM(Z$3:Z226)","v":0},{"$f":"SUM(AA$3:AA226)","v":0},{"$f":"SUM(AB$3:AB226)","v":0}]
[25,"So 17:30",9,null,null,null,null,null,null,null,null,null,null,null,null,null,null,null,null,null,null,null,null,null,null,null,null,null,{"$f":"SUM(W$156:W227)","v":0},{"$f":"SUM(X$156:X227)","v":0},{"$f":"SUM(Y$156:Y227)","v":0},{"$f":"SUM(Z$156:Z227)","v":0},{"$f":"SUM(AA$156:AA227)","v":0},{"$f":"SUM(AB$156:AB227)","v":0},{"$f":"SUM(W$3:W227)","v":0},{"$f":"SUM(X$3:X227)","v":0},{"$f":"SUM(Y$3:Y227)","v":0},{"$f":"SUM(Z$3:Z227)","v":0},{"$f":"SUM(AA$3:AA227)","v":0},{"$f":"SUM(AB$3:AB227)","v":0}]
[26,"Fr 20:30",1,null,null,null,null,null,null,null,null,null,null,null,null,null,null,null,null,null,null,null,null,null,null,null,null,null,{"$f":"SUM(W$156:W228)","v":0},{"$f":"SUM(X$156:X228)","v":0},{"$f":"SUM(Y$156:Y228)","v":0},{"$f":"SUM(Z$156:Z228)","v":0},{"$f":"SUM(AA$156:AA228)","v":0},{"$f":"SUM(AB$156:AB228)","v":0},{"$f":"SUM(W$3:W228)","v":0},{"$f":"SUM(X$3:X228)","v":0},{"$f":"SUM(Y$3:Y228)","v":0},{"$f":"SUM(Z$3:Z228)","v":0},{"$f":"SUM(AA$3:AA228)","v":0},{"$f":"SUM(AB$3:AB228)","v":0}]
[26,"Sa 15:30",2,null,null,null,null,null,null,null,null,null,null,null,null,null,null,null,null,null,null,null,null,null,null,null,null,null,{"$f":"SUM(W$156:W229)","v":0},{"$f":"SUM(X$156:X229)","v":0},{"$f":"SUM(Y$156:Y229)","v":0},{"$f":"SUM(Z$156:Z229)","v":0},{"$f":"SUM(AA$156:AA229)","v":0},{"$f":"SUM(AB$156:AB229)","v":0},{"$f":"SUM(W$3:W229)","v":0},{"$f":"SUM(X$3:X229)","v":0},{"$f":"SUM(Y$3:Y229)","v":0},{"$f":"SUM(Z$3:Z229)","v":0},{"$f":"SUM(AA$3:AA229)","v":0},{"$f":"SUM(AB$3:AB229)","v":0}]
[26,"Sa 15:30",3,null,null,null,null,null,null,null,null,null,null,null,null,null,null,null,null,null,null,null,null,null,null,null,null,null,{"$f":"SUM(W$156:W230)","v":0},{"$f":"SUM(X$156:X230)","v":0},{"$f":"SUM(Y$156:Y230)","v":0},{"$f":"SUM(Z$156:Z230)","v":0},{"$f":"SUM(AA$156:AA230)","v":0},{"$f":"SUM(AB$156:AB230)","v":0},{"$f":"SUM(W$3:W230)","v":0},{"$f":"SUM(X$3:X230)","v":0},{"$f":"SUM(Y$3:Y230)","v":0},{"$f":"SUM(Z$3:Z230)","v":0},{"$f":"SUM(AA$3:AA230)","v":0},{"$f":"SUM(AB$3:AB230)","v":0}]
[26,"Sa 15:30",4,null,null,null,null,null,null,null,null,null,null,null,null,null,null,null,null,null,null,null,null,null,null,null,null,null,{"$f":"SUM(W$156:W231)","v":0},{"$f":"SUM(X$156:X231)","v":0},{"$f":"SUM(Y$156:Y231)","v":0},{"$f":"SUM(Z$156:Z231)","v":0},{"$f":"SUM(AA$156:AA231)","v":0},{"$f":"SUM(AB$156:AB231)","v":0},{"$f":"SUM(W$3:W231)","v":0},{"$f":"SUM(X$3:X231)","v":0},{"$f":"SUM(Y$3:Y231)","v":0},{"$f":"SUM(Z$3:Z231)","v":0},{"$f":"SUM(AA$3:AA231)","v":0},{"$f":"SUM(AB$3:AB231)","v":0}]
[26,"Sa 15:30",5,null,null,null,null,null,null,null,null,null,null,null,null,null,null,null,null,null,null,null,null,null,null,null,null,null,{"$f":"SUM(W$156:W232)","v":0},{"$f":"SUM(X$156:X232)","v":0},{"$f":"SUM(Y$156:Y232)","v":0},{"$f":"SUM(Z$156:Z232)","v":0},{"$f":"SUM(AA$156:AA232)","v":0},{"$f":"SUM(AB$156:AB232)","v":0},{"$f":"SUM(W$3:W232)","v":0},{"$f":"SUM(X$3:X232)","v":0},{"$f":"SUM(Y$3:Y232)","v":0},{"$f":"SUM(Z$3:Z232)","v":0},{"$f":"SUM(AA$3:AA232)","v":0},{"$f":"SUM(AB$3:AB232)","v":0}]
[26,"Sa 18:30",6,null,null,null,null,null,null,null,null,null,null,null,null,null,null,null,null,null,null,null,null,null,null,null,null,null,{"$f":"SUM(W$156:W233)","v":0},{"$f":"SUM(X$156:X233)","v":0},{"$f":"SUM(Y$156:Y233)","v":0},{"$f":"SUM(Z$156:Z233)","v":0},{"$f":"SUM(AA$156:AA233)","v":0},{"$f":"SUM(AB$156:AB233)","v":0},{"$f":"SUM(W$3:W233)","v":0},{"$f":"SUM(X$3:X233)","v":0},{"$f":"SUM(Y$3:Y233)","v":0},{"$f":"SUM(Z$3:Z233)","v":0},{"$f":"SUM(AA$3:AA233)","v":0},{"$f":"SUM(AB$3:AB233)","v":0}]
[26,"So 15:30",7,null,null,null,null,null,null,null,null,null,null,null,null,null,null,null,null,null,null,null,null,null,null,null,null,null,{"$f":"SUM(W$156:W234)","v":0},{"$f":"SUM(X$156:X234)","v":0},{"$f":"SUM(Y$156:Y234)","v":0},{"$f":"SUM(Z$156:Z234)","v":0},{"$f":"SUM(AA$156:AA234)","v":0},{"$f":"SUM(AB$156:AB234)","v":0},{"$f":"SUM(W$3:W234)","v":0},{"$f":"SUM(X$3:X234)","v":0},{"$f":"SUM(Y$3:Y234)","v":0},{"$f":"SUM(Z$3:Z234)","v":0},{"$f":"SUM(AA$3:AA234)","v":0},{"$f":"SUM(AB$3:AB234)","v":0}]
[26,"So 17:30",8,null,null,null,null,null,null,null,null,null,null,null,null,null,null,null,null,null,null,null,null,null,null,null,null,null,{"$f":"SUM(W$156:W235)","v":0},{"$f":"SUM(X$156:X235)","v":0},{"$f":"SUM(Y$156:Y235)","v":0},{"$f":"SUM(Z$156:Z235)","v":0},{"$f":"SUM(AA$156:AA235)","v":0},{"$f":"SUM(AB$156:AB235)","v":0},{"$f":"SUM(W$3:W235)","v":0},{"$f":"SUM(X$3:X235)","v":0},{"$f":"SUM(Y$3:Y235)","v":0},{"$f":"SUM(Z$3:Z235)","v":0},{"$f":"SUM(AA$3:AA235)","v":0},{"$f":"SUM(AB$3:AB235)","v":0}]
[26,"So 19:30",9,null,null,null,null,null,null,null,null,null,null,null,null,null,null,null,null,null,null,null,null,null,null,null,null,null,{"$f":"SUM(W$156:W236)","v":0},{"$f":"SUM(X$156:X236)","v":0},{"$f":"SUM(Y$156:Y236)","v":0},{"$f":"SUM(Z$156:Z236)","v":0},{"$f":"SUM(AA$156:AA236)","v":0},{"$f":"SUM(AB$156:AB236)","v":0},{"$f":"SUM(W$3:W236)","v":0},{"$f":"SUM(X$3:X236)","v":0},{"$f":"SUM(Y$3:Y236)","v":0},{"$f":"SUM(Z$3:Z236)","v":0},{"$f":"SUM(AA$3:AA236)","v":0},{"$f":"SUM(AB$3:AB236)","v":0}]
[27,"Fr 20:30",1,null,null,null,null,null,null,null,null,null,null,null,null,null,null,null,null,null,null,null,null,null,null,null,null,null,{"$f":"SUM(W$156:W237)","v":0},{"$f":"SUM(X$156:X237)","v":0},{"$f":"SUM(Y$156:Y237)","v":0},{"$f":"SUM(Z$156:Z237)","v":0},{"$f":"SUM(AA$156:AA237)","v":0},{"$f":"SUM(AB$156:AB237)","v":0},{"$f":"SUM(W$3:W237)","v":0},{"$f":"SUM(X$3:X237)","v":0},{"$f":"SUM(Y$3:Y237)","v":0},{"$f":"SUM(Z$3:Z237)","v":0},{"$f":"SUM(AA$3:AA237)","v":0},{"$f":"SUM(AB$3:AB237)","v":0}]
[27,"Sa 15:30",2,null,null,null,null,null,null,null,null,null,null,null,null,null,null,null,null,null,null,null,null,null,null,null,null,null,{"$f":"SUM(W$156:W238)","v":0},{"$f":"SUM(X$156:X238)","v":0},{"$f":"SUM(Y$156:Y238)","v":0},{"$f":"SUM(Z$156:Z238)","v":0},{"$f":"SUM(AA$156:AA238)","v":0},{"$f":"SUM(AB$156:AB238)","v":0},{"$f":"SUM(W$3:W238)","v":0},{"$f":"SUM(X$3:X238)","v":0},{"$f":"SUM(Y$3:Y238)","v":0},{"$f":"SUM(Z$3:Z238)","v":0},{"$f":"SUM(AA$3:AA238)","v":0},{"$f":"SUM(AB$3:AB238)","v":0}]
[27,"Sa 15:30",3,null,null,null,null,null,null,null,null,null,null,null,null,null,null,null,null,null,null,null,null,null,null,null,null,null,{"$f":"SUM(W$156:W239)","v":0},{"$f":"SUM(X$156:X239)","v":0},{"$f":"SUM(Y$156:Y239)","v":0},{"$f":"SUM(Z$156:Z239)","v":0},{"$f":"SUM(AA$156:AA239)","v":0},{"$f":"SUM(AB$156:AB239)","v":0},{"$f":"SUM(W$3:W239)","v":0},{"$f":"SUM(X$3:X239)","v":0},{"$f":"SUM(Y$3:Y239)","v":0},{"$f":"SUM(Z$3:Z239)","v":0},{"$f":"SUM(AA$3:AA239)","v":0},{"$f":"SUM(AB$3:AB239)","v":0}]
[27,"Sa 15:30",4,null,null,null,null,null,null,null,null,null,null,null,null,null,null,null,null,null,null,null,null,null,null,null,null,null,{"$f":"SUM(W$156:W240)","v":0},{"$f":"SUM(X$156:X240)","v":0},{"$f":"SUM(Y$156:Y240)","v":0},{"$f":"SUM(Z$156:Z240)","v":0},{"$f":"SUM(AA$156:AA240)","v":0},{"$f":"SUM(AB$156:AB240)","v":0},{"$f":"SUM(W$3:W240)","v":0},{"$f":"SUM(X$3:X240)","v":0},{"$f":"SUM(Y$3:Y240)","v":0},{"$f":"SUM(Z$3:Z240)","v":0},{"$f":"SUM(AA$3:AA240)","v":0},{"$f":"SUM(AB$3:AB240)","v":0}]
[27,"Sa 15:30",5,null,null,null,null,null,null,null,null,null,null,null,null,null,null,null,null,null,null,null,null,null,null,null,null,null,{"$f":"SUM(W$156:W241)","v":0},{"$f":"SUM(X$156:X241)","v":0},{"$f":"SUM(Y$156:Y241)","v":0},{"$f":"SUM(Z$156:Z241)","v":0},{"$f":"SUM(AA$156:AA241)","v":0},{"$f":"SUM(AB$156:AB241)","v":0},{"$f":"SUM(W$3:W241)","v":0},{"$f":"SUM(X$3:X241)","v":0},{"$f":"SUM(Y$3:Y241)","v":0},{"$f":"SUM(Z$3:Z241)","v":0},{"$f":"SUM(AA$3:AA241)","v":0},{"$f":"SUM(AB$3:AB241)","v":0}]
[27,"Sa 18:30",6,null,null,null,null,null,null,null,null,null,null,null,null,null,null,null,null,null,null,null,null,null,null,null,null,null,{"$f":"SUM(W$156:W242)","v":0},{"$f":"SUM(X$156:X242)","v":0},{"$f":"SUM(Y$156:Y242)","v":0},{"$f":"SUM(Z$156:Z242)","v":0},{"$f":"SUM(AA$156:AA242)","v":0},{"$f":"SUM(AB$156:AB242)","v":0},{"$f":"SUM(W$3:W242)","v":0},{"$f":"SUM(X$3:X242)","v":0},{"$f":"SUM(Y$3:Y242)","v":0},{"$f":"SUM(Z$3:Z242)","v":0},{"$f":"SUM(AA$3:AA242)","v":0},{"$f":"SUM(AB$3:AB242)","v":0}]
[27,"So 15:30",7,null,null,null,null,null,null,null,null,null,null,null,null,null,null,null,null,null,null,null,null,null,null,null,null,null,{"$f":"SUM(W$156:W243)","v":0},{"$f":"SUM(X$156:X243)","v":0},{"$f":"SUM(Y$156:Y243)","v":0},{"$f":"SUM(Z$156:Z243)","v":0},{"$f":"SUM(AA$156:AA243)","v":0},{"$f":"SUM(AB$156:AB243)","v":0},{"$f":"SUM(W$3:W243)","v":0},{"$f":"SUM(X$3:X243)","v":0},{"$f":"SUM(Y$3:Y243)","v":0},{"$f":"SUM(Z$3:Z243)","v":0},{"$f":"SUM(AA$3:AA243)","v":0},{"$f":"SUM(AB$3:AB243)","v":0}]
[27,"So 17:30",8,null,null,null,null,null,null,null,null,null,null,null,null,null,null,null,null,null,null,null,null,null,null,null,null,null,{"$f":"SUM(W$156:W244)","v":0},{"$f":"SUM(X$156:X244)","v":0},{"$f":"SUM(Y$156:Y244)","v":0},{"$f":"SUM(Z$156:Z244)","v":0},{"$f":"SUM(AA$156:AA244)","v":0},{"$f":"SUM(AB$156:AB244)","v":0},{"$f":"SUM(W$3:W244)","v":0},{"$f":"SUM(X$3:X244)","v":0},{"$f":"SUM(Y$3:Y244)","v":0},{"$f":"SUM(Z$3:Z244)","v":0},{"$f":"SUM(AA$3:AA244)","v":0},{"$f":"SUM(AB$3:AB244)","v":0}]
[27,"So 19:30",9,null,null,null,null,null,null,null,null,null,null,null,null,null,null,null,null,null,null,null,null,null,null,null,null,null,{"$f":"SUM(W$156:W245)","v":0},{"$f":"SUM(X$156:X245)","v":0},{"$f":"SUM(Y$156:Y245)","v":0},{"$f":"SUM(Z$156:Z245)","v":0},{"$f":"SUM(AA$156:AA245)","v":0},{"$f":"SUM(AB$156:AB245)","v":0},{"$f":"SUM(W$3:W245)","v":0},{"$f":"SUM(X$3:X245)","v":0},{"$f":"SUM(Y$3:Y245)","v":0},{"$f":"SUM(Z$3:Z245)","v":0},{"$f":"SUM(AA$3:AA245)","v":0},{"$f":"SUM(AB$3:AB245)","v":0}]
[28,"Sa 15:30",1,null,null,null,null,null,null,null,null,null,null,null,null,null,null,null,null,null,null,null,null,null,null,null,null,null,{"$f":"SUM(W$156:W246)","v":0},{"$f":"SUM(X$156:X246)","v":0},{"$f":"SUM(Y$156:Y246)","v":0},{"$f":"SUM(Z$156:Z246)","v":0},{"$f":"SUM(AA$156:AA246)","v":0},{"$f":"SUM(AB$156:AB246)","v":0},{"$f":"SUM(W$3:W246)","v":0},{"$f":"SUM(X$3:X246)","v":0},{"$f":"SUM(Y$3:Y246)","v":0},{"$f":"SUM(Z$3:Z246)","v":0},{"$f":"SUM(AA$3:AA246)","v":0},{"$f":"SUM(AB$3:AB246)","v":0}]
[28,"Sa 15:30",2,null,null,null,null,null,null,null,null,null,null,null,null,null,null,null,null,null,null,null,null,null,null,null,null,null,{"$f":"SUM(W$156:W247)","v":0},{"$f":"SUM(X$156:X247)","v":0},{"$f":"SUM(Y$156:Y247)","v":0},{"$f":"SUM(Z$156:Z247)","v":0},{"$f":"SUM(AA$156:AA247)","v":0},{"$f":"SUM(AB$156:AB247)","v":0},{"$f":"SUM(W$3:W247)","v":0},{"$f":"SUM(X$3:X247)","v":0},{"$f":"SUM(Y$3:Y247)","v":0},{"$f":"SUM(Z$3:Z247)","v":0},{"$f":"SUM(AA$3:AA247)","v":0},{"$f":"SUM(AB$3:AB247)","v":0}]
[28,"Sa 15:30",3,null,null,null,null,null,null,null,null,null,null,null,null,null,null,null,null,null,null,null,null,null,null,null,null,null,{"$f":"SUM(W$156:W248)","v":0},{"$f":"SUM(X$156:X248)","v":0},{"$f":"SUM(Y$156:Y248)","v":0},{"$f":"SUM(Z$156:Z248)","v":0},{"$f":"SUM(AA$156:AA248)","v":0},{"$f":"SUM(AB$156:AB248)","v":0},{"$f":"SUM(W$3:W248)","v":0},{"$f":"SUM(X$3:X248)","v":0},{"$f":"SUM(Y$3:Y248)","v":0},{"$f":"SUM(Z$3:Z248)","v":0},{"$f":"SUM(AA$3:AA248)","v":0},{"$f":"SUM(AB$3:AB248)","v":0}]
[28,"Sa 15:30",4,null,null,null,null,null,null,null,null,null,null,null,null,null,null,null,null,null,null,null,null,null,null,null,null,null,{"$f":"SUM(W$156:W249)","v":0},{"$f":"SUM(X$156:X249)","v":0},{"$f":"SUM(Y$156:Y249)","v":0},{"$f":"SUM(Z$156:Z249)","v":0},{"$f":"SUM(AA$156:AA249)","v":0},{"$f":"SUM(AB$156:AB249)","v":0},{"$f":"SUM(W$3:W249)","v":0},{"$f":"SUM(X$3:X249)","v":0},{"$f":"SUM(Y$3:Y249)","v":0},{"$f":"SUM(Z$3:Z249)","v":0},{"$f":"SUM(AA$3:AA249)","v":0},{"$f":"SUM(AB$3:AB249)","v":0}]
[28,"Sa 15:30",5,null,null,null,null,null,null,null,null,null,null,null,null,null,null,null,null,null,null,null,null,null,null,null,null,null,{"$f":"SUM(W$156:W250)","v":0},{"$f":"SUM(X$156:X250)","v":0},{"$f":"SUM(Y$156:Y250)","v":0},{"$f":"SUM(Z$156:Z250)","v":0},{"$f":"SUM(AA$156:AA250)","v":0},{"$f":"SUM(AB$156:AB250)","v":0},{"$f":"SUM(W$3:W250)","v":0},{"$f":"SUM(X$3:X250)","v":0},{"$f":"SUM(Y$3:Y250)","v":0},{"$f":"SUM(Z$3:Z250)","v":0},{"$f":"SUM(AA$3:AA250)","v":0},{"$f":"SUM(AB$3:AB250)","v":0}]
[28,"Sa 15:30",6,null,null,null,null,null,null,null,null,null,null,null,null,null,null,null,null,null,null,null,null,null,null,null,null,null,{"$f":"SUM(W$156:W251)","v":0},{"$f":"SUM(X$156:X251)","v":0},{"$f":"SUM(Y$156:Y251)","v":0},{"$f":"SUM(Z$156:Z251)","v":0},{"$f":"SUM(AA$156:AA251)","v":0},{"$f":"SUM(AB$156:AB251)","v":0},{"$f":"SUM(W$3:W251)","v":0},{"$f":"SUM(X$3:X251)","v":0},{"$f":"SUM(Y$3:Y251)","v":0},{"$f":"SUM(Z$3:Z251)","v":0},{"$f":"SUM(AA$3:AA251)","v":0},{"$f":"SUM(AB$3:AB251)","v":0}]
[28,"Sa 18:30",7,null,null,null,null,null,null,null,null,null,null,null,null,null,null,null,null,null,null,null,null,null,null,null,null,null,{"$f":"SUM(W$156:W252)","v":0},{"$f":"SUM(X$156:X252)","v":0},{"$f":"SUM(Y$156:Y252)","v":0},{"$f":"SUM(Z$156:Z252)","v":0},{"$f":"SUM(AA$156:AA252)","v":0},{"$f":"SUM(AB$156:AB252)","v":0},{"$f":"SUM(W$3:W252)","v":0},{"$f":"SUM(X$3:X252)","v":0},{"$f":"SUM(Y$3:Y252)","v":0},{"$f":"SUM(Z$3:Z252)","v":0},{"$f":"SUM(AA$3:AA252)","v":0},{"$f":"SUM(AB$3:AB252)","v":0}]
[28,"So 15:30",8,null,null,null,null,null,null,null,null,null,null,null,null,null,null,null,null,null,null,null,null,null,null,null,null,null,{"$f":"SUM(W$156:W253)","v":0},{"$f":"SUM(X$156:X253)","v":0},{"$f":"SUM(Y$156:Y253)","v":0},{"$f":"SUM(Z$156:Z253)","v":0},{"$f":"SUM(AA$156:AA253)","v":0},{"$f":"SUM(AB$156:AB253)","v":0},{"$f":"SUM(W$3:W253)","v":0},{"$f":"SUM(X$3:X253)","v":0},{"$f":"SUM(Y$3:Y253)","v":0},{"$f":"SUM(Z$3:Z253)","v":0},{"$f":"SUM(AA$3:AA253)","v":0},{"$f":"SUM(AB$3:AB253)","v":0}]
[28,"So 17:30",9,null,null,null,null,null,null,null,null,null,null,null,null,null,null,null,null,null,null,null,null,null,null,null,null,null,{"$f":"SUM(W$156:W254)","v":0},{"$f":"SUM(X$156:X254)","v":0},{"$f":"SUM(Y$156:Y254)","v":0},{"$f":"SUM(Z$156:Z254)","v":0},{"$f":"SUM(AA$156:AA254)","v":0},{"$f":"SUM(AB$156:AB254)","v":0},{"$f":"SUM(W$3:W254)","v":0},{"$f":"SUM(X$3:X254)","v":0},{"$f":"SUM(Y$3:Y254)","v":0},{"$f":"SUM(Z$3:Z254)","v":0},{"$f":"SUM(AA$3:AA254)","v":0},{"$f":"SUM(AB$3:AB254)","v":0}]
[29,"Fr 20:30",1,null,null,null,null,null,null,null,null,null,null,null,null,null,null,null,null,null,null,null,null,null,null,null,null,null,{"$f":"SUM(W$156:W255)","v":0},{"$f":"SUM(X$156:X255)","v":0},{"$f":"SUM(Y$156:Y255)","v":0},{"$f":"SUM(Z$156:Z255)","v":0},{"$f":"SUM(AA$156:AA255)","v":0},{"$f":"SUM(AB$156:AB255)","v":0},{"$f":"SUM(W$3:W255)","v":0},{"$f":"SUM(X$3:X255)","v":0},{"$f":"SUM(Y$3:Y255)","v":0},{"$f":"SUM(Z$3:Z255)","v":0},{"$f":"SUM(AA$3:AA255)","v":0},{"$f":"SUM(AB$3:AB255)","v":0}]
[29,"Sa 15:30",2,null,null,null,null,null,null,null,null,null,null,null,null,null,null,null,null,null,null,null,null,null,null,null,null,null,{"$f":"SUM(W$156:W256)","v":0},{"$f":"SUM(X$156:X256)","v":0},{"$f":"SUM(Y$156:Y256)","v":0},{"$f":"SUM(Z$156:Z256)","v":0},{"$f":"SUM(AA$156:AA256)","v":0},{"$f":"SUM(AB$156:AB256)","v":0},{"$f":"SUM(W$3:W256)","v":0},{"$f":"SUM(X$3:X256)","v":0},{"$f":"SUM(Y$3:Y256)","v":0},{"$f":"SUM(Z$3:Z256)","v":0},{"$f":"SUM(AA$3:AA256)","v":0},{"$f":"SUM(AB$3:AB256)","v":0}]
[29,"Sa 15:30",3,null,null,null,null,null,null,null,null,null,null,null,null,null,null,null,null,null,null,null,null,null,null,null,null,null,{"$f":"SUM(W$156:W257)","v":0},{"$f":"SUM(X$156:X257)","v":0},{"$f":"SUM(Y$156:Y257)","v":0},{"$f":"SUM(Z$156:Z257)","v":0},{"$f":"SUM(AA$156:AA257)","v":0},{"$f":"SUM(AB$156:AB257)","v":0},{"$f":"SUM(W$3:W257)","v":0},{"$f":"SUM(X$3:X257)","v":0},{"$f":"SUM(Y$3:Y257)","v":0},{"$f":"SUM(Z$3:Z257)","v":0},{"$f":"SUM(AA$3:AA257)","v":0},{"$f":"SUM(AB$3:AB257)","v":0}]
[29,"Sa 15:30",4,null,null,null,null,null,null,null,null,null,null,null,null,null,null,null,null,null,null,null,null,null,null,null,null,null,{"$f":"SUM(W$156:W258)","v":0},{"$f":"SUM(X$156:X258)","v":0},{"$f":"SUM(Y$156:Y258)","v":0},{"$f":"SUM(Z$156:Z258)","v":0},{"$f":"SUM(AA$156:AA258)","v":0},{"$f":"SUM(AB$156:AB258)","v":0},{"$f":"SUM(W$3:W258)","v":0},{"$f":"SUM(X$3:X258)","v":0},{"$f":"SUM(Y$3:Y258)","v":0},{"$f":"SUM(Z$3:Z258)","v":0},{"$f":"SUM(AA$3:AA258)","v":0},{"$f":"SUM(AB$3:AB258)","v":0}]
[29,"Sa 15:30",5,null,null,null,null,null,null,null,null,null,null,null,null,null,null,null,null,null,null,null,null,null,null,null,null,null,{"$f":"SUM(W$156:W259)","v":0},{"$f":"SUM(X$156:X259)","v":0},{"$f":"SUM(Y$156:Y259)","v":0},{"$f":"SUM(Z$156:Z259)","v":0},{"$f":"SUM(AA$156:AA259)","v":0},{"$f":"SUM(AB$156:AB259)","v":0},{"$f":"SUM(W$3:W259)","v":0},{"$f":"SUM(X$3:X259)","v":0},{"$f":"SUM(Y$3:Y259)","v":0},{"$f":"SUM(Z$3:Z259)","v":0},{"$f":"SUM(AA$3:AA259)","v":0},{"$f":"SUM(AB$3:AB259)","v":0}]
[29,"Sa 18:30",6,null,null,null,null,null,null,null,null,null,null,null,null,null,null,null,null,null,null,null,null,null,null,null,null,null,{"$f":"SUM(W$156:W260)","v":0},{"$f":"SUM(X$156:X260)","v":0},{"$f":"SUM(Y$156:Y260)","v":0},{"$f":"SUM(Z$156:Z260)","v":0},{"$f":"SUM(AA$156:AA260)","v":0},{"$f":"SUM(AB$156:AB260)","v":0},{"$f":"SUM(W$3:W260)","v":0},{"$f":"SUM(X$3:X260)","v":0},{"$f":"SUM(Y$3:Y260)","v":0},{"$f":"SUM(Z$3:Z260)","v":0},{"$f":"SUM(AA$3:AA260)","v":0},{"$f":"SUM(AB$3:AB260)","v":0}]
[29,"So 15:30",7,null,null,null,null,null,null,null,null,null,null,null,null,null,null,null,null,null,null,null,null,null,null,null,null,null,{"$f":"SUM(W$156:W261)","v":0},{"$f":"SUM(X$156:X261)","v":0},{"$f":"SUM(Y$156:Y261)","v":0},{"$f":"SUM(Z$156:Z261)","v":0},{"$f":"SUM(AA$156:AA261)","v":0},{"$f":"SUM(AB$156:AB261)","v":0},{"$f":"SUM(W$3:W261)","v":0},{"$f":"SUM(X$3:X261)","v":0},{"$f":"SUM(Y$3:Y261)","v":0},{"$f":"SUM(Z$3:Z261)","v":0},{"$f":"SUM(AA$3:AA261)","v":0},{"$f":"SUM(AB$3:AB261)","v":0}]
[29,"So 17:30",8,null,null,null,null,null,null,null,null,null,null,null,null,null,null,null,null,null,null,null,null,null,null,null,null,null,{"$f":"SUM(W$156:W262)","v":0},{"$f":"SUM(X$156:X262)","v":0},{"$f":"SUM(Y$156:Y262)","v":0},{"$f":"SUM(Z$156:Z262)","v":0},{"$f":"SUM(AA$156:AA262)","v":0},{"$f":"SUM(AB$156:AB262)","v":0},{"$f":"SUM(W$3:W262)","v":0},{"$f":"SUM(X$3:X262)","v":0},{"$f":"SUM(Y$3:Y262)","v":0},{"$f":"SUM(Z$3:Z262)","v":0},{"$f":"SUM(AA$3:AA262)","v":0},{"$f":"SUM(AB$3:AB262)","v":0}]
[29,"So 19:30",9,null,null,null,null,null,null,null,null,null,null,null,null,null,null,null,null,null,null,null,null,null,null,null,null,null,{"$f":"SUM(W$156:W263)","v":0},{"$f":"SUM(X$156:X263)","v":0},{"$f":"SUM(Y$156:Y263)","v":0},{"$f":"SUM(Z$156:Z263)","v":0},{"$f":"SUM(AA$156:AA263)","v":0},{"$f":"SUM(AB$156:AB263)","v":0},{"$f":"SUM(W$3:W263)","v":0},{"$f":"SUM(X$3:X263)","v":0},{"$f":"SUM(Y$3:Y263)","v":0},{"$f":"SUM(Z$3:Z263)","v":0},{"$f":"SUM(AA$3:AA263)","v":0},{"$f":"SUM(AB$3:AB263)","v":0}]
[30,"Fr 20:30",1,null,null,null,null,null,null,null,null,null,null,null,null,null,null,null,null,null,null,null,null,null,null,null,null,null,{"$f":"SUM(W$156:W264)","v":0},{"$f":"SUM(X$156:X264)","v":0},{"$f":"SUM(Y$156:Y264)","v":0},{"$f":"SUM(Z$156:Z264)","v":0},{"$f":"SUM(AA$156:AA264)","v":0},{"$f":"SUM(AB$156:AB264)","v":0},{"$f":"SUM(W$3:W264)","v":0},{"$f":"SUM(X$3:X264)","v":0},{"$f":"SUM(Y$3:Y264)","v":0},{"$f":"SUM(Z$3:Z264)","v":0},{"$f":"SUM(AA$3:AA264)","v":0},{"$f":"SUM(AB$3:AB264)","v":0}]
[30,"Sa 15:30",2,null,null,null,null,null,null,null,null,null,null,null,null,null,null,null,null,null,null,null,null,null,null,null,null,null,{"$f":"SUM(W$156:W265)","v":0},{"$f":"SUM(X$156:X265)","v":0},{"$f":"SUM(Y$156:Y265)","v":0},{"$f":"SUM(Z$156:Z265)","v":0},{"$f":"SUM(AA$156:AA265)","v":0},{"$f":"SUM(AB$156:AB265)","v":0},{"$f":"SUM(W$3:W265)","v":0},{"$f":"SUM(X$3:X265)","v":0},{"$f":"SUM(Y$3:Y265)","v":0},{"$f":"SUM(Z$3:Z265)","v":0},{"$f":"SUM(AA$3:AA265)","v":0},{"$f":"SUM(AB$3:AB265)","v":0}]
[30,"Sa 15:30",3,null,null,null,null,null,null,null,null,null,null,null,null,null,null,null,null,null,null,null,null,null,null,null,null,null,{"$f":"SUM(W$156:W266)","v":0},{"$f":"SUM(X$156:X266)","v":0},{"$f":"SUM(Y$156:Y266)","v":0},{"$f":"SUM(Z$156:Z266)","v":0},{"$f":"SUM(AA$156:AA266)","v":0},{"$f":"SUM(AB$156:AB266)","v":0},{"$f":"SUM(W$3:W266)","v":0},{"$f":"SUM(X$3:X266)","v":0},{"$f":"SUM(Y$3:Y266)","v":0},{"$f":"SUM(Z$3:Z266)","v":0},{"$f":"SUM(AA$3:AA266)","v":0},{"$f":"SUM(AB$3:AB266)","v":0}]
[30,"Sa 15:30",4,null,null,null,null,null,null,null,null,null,null,null,null,null,null,null,null,null,null,null,null,null,null,null,null,null,{"$f":"SUM(W$156:W267)","v":0},{"$f":"SUM(X$156:X267)","v":0},{"$f":"SUM(Y$156:Y267)","v":0},{"$f":"SUM(Z$156:Z267)","v":0},{"$f":"SUM(AA$156:AA267)","v":0},{"$f":"SUM(AB$156:AB267)","v":0},{"$f":"SUM(W$3:W267)","v":0},{"$f":"SUM(X$3:X267)","v":0},{"$f":"SUM(Y$3:Y267)","v":0},{"$f":"SUM(Z$3:Z267)","v":0},{"$f":"SUM(AA$3:AA267)","v":0},{"$f":"SUM(AB$3:AB267)","v":0}]
[30,"Sa 15:30",5,null,null,null,null,null,null,null,null,null,null,null,null,null,null,null,null,null,null,null,null,null,null,null,null,null,{"$f":"SUM(W$156:W268)","v":0},{"$f":"SUM(X$156:X268)","v":0},{"$f":"SUM(Y$156:Y268)","v":0},{"$f":"SUM(Z$156:Z268)","v":0},{"$f":"SUM(AA$156:AA268)","v":0},{"$f":"SUM(AB$156:AB268)","v":0},{"$f":"SUM(W$3:W268)","v":0},{"$f":"SUM(X$3:X268)","v":0},{"$f":"SUM(Y$3:Y268)","v":0},{"$f":"SUM(Z$3:Z268)","v":0},{"$f":"SUM(AA$3:AA268)","v":0},{"$f":"SUM(AB$3:AB268)","v":0}]
[30,"Sa 18:30",6,null,null,null,null,null,null,null,null,null,null,null,null,null,null,null,null,null,null,null,null,null,null,null,null,null,{"$f":"SUM(W$156:W269)","v":0},{"$f":"SUM(X$156:X269)","v":0},{"$f":"SUM(Y$156:Y269)","v":0},{"$f":"SUM(Z$156:Z269)","v":0},{"$f":"SUM(AA$156:AA269)","v":0},{"$f":"SUM(AB$156:AB269)","v":0},{"$f":"SUM(W$3:W269)","v":0},{"$f":"SUM(X$3:X269)","v":0},{"$f":"SUM(Y$3:Y269)","v":0},{"$f":"SUM(Z$3:Z269)","v":0},{"$f":"SUM(AA$3:AA269)","v":0},{"$f":"SUM(AB$3:AB269)","v":0}]
[30,"So 15:30",7,null,null,null,null,null,null,null,null,null,null,null,null,null,null,null,null,null,null,null,null,null,null,null,null,null,{"$f":"SUM(W$156:W270)","v":0},{"$f":"SUM(X$156:X270)","v":0},{"$f":"SUM(Y$156:Y270)","v":0},{"$f":"SUM(Z$156:Z270)","v":0},{"$f":"SUM(AA$156:AA270)","v":0},{"$f":"SUM(AB$156:AB270)","v":0},{"$f":"SUM(W$3:W270)","v":0},{"$f":"SUM(X$3:X270)","v":0},{"$f":"SUM(Y$3:Y270)","v":0},{"$f":"SUM(Z$3:Z270)","v":0},{"$f":"SUM(AA$3:AA270)","v":0},{"$f":"SUM(AB$3:AB270)","v":0}]
[30,"So 17:30",8,null,null,null,null,null,null,null,null,null,null,null,null,null,null,null,null,null,null,null,null,null,null,null,null,null,{"$f":"SUM(W$156:W271)","v":0},{"$f":"SUM(X$156:X271)","v":0},{"$f":"SUM(Y$156:Y271)","v":0},{"$f":"SUM(Z$156:Z271)","v":0},{"$f":"SUM(AA$156:AA271)","v":0},{"$f":"SUM(AB$156:AB271)","v":0},{"$f":"SUM(W$3:W271)","v":0},{"$f":"SUM(X$3:X271)","v":0},{"$f":"SUM(Y$3:Y271)","v":0},{"$f":"SUM(Z$3:Z271)","v":0},{"$f":"SUM(AA$3:AA271)","v":0},{"$f":"SUM(AB$3:AB271)","v":0}]
[30,"So 19:30",9,null,null,null,null,null,null,null,null,null,null,null,null,null,null,null,null,null,null,null,null,null,null,null,null,null,{"$f":"SUM(W$156:W272)","v":0},{"$f":"SUM(X$156:X272)","v":0},{"$f":"SUM(Y$156:Y272)","v":0},{"$f":"SUM(Z$156:Z272)","v":0},{"$f":"SUM(AA$156:AA272)","v":0},{"$f":"SUM(AB$156:AB272)","v":0},{"$f":"SUM(W$3:W272)","v":0},{"$f":"SUM(X$3:X272)","v":0},{"$f":"SUM(Y$3:Y272)","v":0},{"$f":"SUM(Z$3:Z272)","v":0},{"$f":"SUM(AA$3:AA272)","v":0},{"$f":"SUM(AB$3:AB272)","v":0}]
[31,"Fr  20:30",1,null,null,null,null,null,null,null,null,null,null,null,null,null,null,null,null,null,null,null,null,null,null,null,null,null,{"$f":"SUM(W$156:W273)","v":0},{"$f":"SUM(X$156:X273)","v":0},{"$f":"SUM(Y$156:Y273)","v":0},{"$f":"SUM(Z$156:Z273)","v":0},{"$f":"SUM(AA$156:AA273)","v":0},{"$f":"SUM(AB$156:AB273)","v":0},{"$f":"SUM(W$3:W273)","v":0},{"$f":"SUM(X$3:X273)","v":0},{"$f":"SUM(Y$3:Y273)","v":0},{"$f":"SUM(Z$3:Z273)","v":0},{"$f":"SUM(AA$3:AA273)","v":0},{"$f":"SUM(AB$3:AB273)","v":0}]
[31,"Sa 15:30",2,null,null,null,null,null,null,null,null,null,null,null,null,null,null,null,null,null,null,null,null,null,null,null,null,null,{"$f":"SUM(W$156:W274)","v":0},{"$f":"SUM(X$156:X274)","v":0},{"$f":"SUM(Y$156:Y274)","v":0},{"$f":"SUM(Z$156:Z274)","v":0},{"$f":"SUM(AA$156:AA274)","v":0},{"$f":"SUM(AB$156:AB274)","v":0},{"$f":"SUM(W$3:W274)","v":0},{"$f":"SUM(X$3:X274)","v":0},{"$f":"SUM(Y$3:Y274)","v":0},{"$f":"SUM(Z$3:Z274)","v":0},{"$f":"SUM(AA$3:AA274)","v":0},{"$f":"SUM(AB$3:AB274)","v":0}]
[31,"Sa 15:30",3,null,null,null,null,null,null,null,null,null,null,null,null,null,null,null,null,null,null,null,null,null,null,null,null,null,{"$f":"SUM(W$156:W275)","v":0},{"$f":"SUM(X$156:X275)","v":0},{"$f":"SUM(Y$156:Y275)","v":0},{"$f":"SUM(Z$156:Z275)","v":0},{"$f":"SUM(AA$156:AA275)","v":0},{"$f":"SUM(AB$156:AB275)","v":0},{"$f":"SUM(W$3:W275)","v":0},{"$f":"SUM(X$3:X275)","v":0},{"$f":"SUM(Y$3:Y275)","v":0},{"$f":"SUM(Z$3:Z275)","v":0},{"$f":"SUM(AA$3:AA275)","v":0},{"$f":"SUM(AB$3:AB275)","v":0}]
[31,"Sa 15:30",4,null,null,null,null,null,null,null,null,null,null,null,null,null,null,null,null,null,null,null,null,null,null,null,null,null,{"$f":"SUM(W$156:W276)","v":0},{"$f":"SUM(X$156:X276)","v":0},{"$f":"SUM(Y$156:Y276)","v":0},{"$f":"SUM(Z$156:Z276)","v":0},{"$f":"SUM(AA$156:AA276)","v":0},{"$f":"SUM(AB$156:AB276)","v":0},{"$f":"SUM(W$3:W276)","v":0},{"$f":"SUM(X$3:X276)","v":0},{"$f":"SUM(Y$3:Y276)","v":0},{"$f":"SUM(Z$3:Z276)","v":0},{"$f":"SUM(AA$3:AA276)","v":0},{"$f":"SUM(AB$3:AB276)","v":0}]
[31,"Sa 15:30",5,null,null,null,null,null,null,null,null,null,null,null,null,null,null,null,null,null,null,null,null,null,null,null,null,null,{"$f":"SUM(W$156:W277)","v":0},{"$f":"SUM(X$156:X277)","v":0},{"$f":"SUM(Y$156:Y277)","v":0},{"$f":"SUM(Z$156:Z277)","v":0},{"$f":"SUM(AA$156:AA277)","v":0},{"$f":"SUM(AB$156:AB277)","v":0},{"$f":"SUM(W$3:W277)","v":0},{"$f":"SUM(X$3:X277)","v":0},{"$f":"SUM(Y$3:Y277)","v":0},{"$f":"SUM(Z$3:Z277)","v":0},{"$f":"SUM(AA$3:AA277)","v":0},{"$f":"SUM(AB$3:AB277)","v":0}]
[31,"Sa 15:30",6,null,null,null,null,null,null,null,null,null,null,null,null,null,null,null,null,null,null,null,null,null,null,null,null,null,{"$f":"SUM(W$156:W278)","v":0},{"$f":"SUM(X$156:X278)","v":0},{"$f":"SUM(Y$156:Y278)","v":0},{"$f":"SUM(Z$156:Z278)","v":0},{"$f":"SUM(AA$156:AA278)","v":0},{"$f":"SUM(AB$156:AB278)","v":0},{"$f":"SUM(W$3:W278)","v":0},{"$f":"SUM(X$3:X278)","v":0},{"$f":"SUM(Y$3:Y278)","v":0},{"$f":"SUM(Z$3:Z278)","v":0},{"$f":"SUM(AA$3:AA278)","v":0},{"$f":"SUM(AB$3:AB278)","v":0}]
[31,"Sa 18:30",7,null,null,null,null,null,null,null,null,null,null,null,null,null,null,null,null,null,null,null,null,null,null,null,null,null,{"$f":"SUM(W$156:W279)","v":0},{"$f":"SUM(X$156:X279)","v":0},{"$f":"SUM(Y$156:Y279)","v":0},{"$f":"SUM(Z$156:Z279)","v":0},{"$f":"SUM(AA$156:AA279)","v":0},{"$f":"SUM(AB$156:AB279)","v":0},{"$f":"SUM(W$3:W279)","v":0},{"$f":"SUM(X$3:X279)","v":0},{"$f":"SUM(Y$3:Y279)","v":0},{"$f":"SUM(Z$3:Z279)","v":0},{"$f":"SUM(AA$3:AA279)","v":0},{"$f":"SUM(AB$3:AB279)","v":0}]
[31,"So 15:30",8,null,null,null,null,null,null,null,null,null,null,null,null,null,null,null,null,null,null,null,null,null,null,null,null,null,{"$f":"SUM(W$156:W280)","v":0},{"$f":"SUM(X$156:X280)","v":0},{"$f":"SUM(Y$156:Y280)","v":0},{"$f":"SUM(Z$156:Z280)","v":0},{"$f":"SUM(AA$156:AA280)","v":0},{"$f":"SUM(AB$156:AB280)","v":0},{"$f":"SUM(W$3:W280)","v":0},{"$f":"SUM(X$3:X280)","v":0},{"$f":"SUM(Y$3:Y280)","v":0},{"$f":"SUM(Z$3:Z280)","v":0},{"$f":"SUM(AA$3:AA280)","v":0},{"$f":"SUM(AB$3:AB280)","v":0}]
[31,"So 17:30",9,null,null,null,null,null,null,null,null,null,null,null,null,null,null,null,null,null,null,null,null,null,null,null,null,null,{"$f":"SUM(W$156:W281)","v":0},{"$f":"SUM(X$156:X281)","v":0},{"$f":"SUM(Y$156:Y281)","v":0},{"$f":"SUM(Z$156:Z281)","v":0},{"$f":"SUM(AA$156:AA281)","v":0},{"$f":"SUM(AB$156:AB281)","v":0},{"$f":"SUM(W$3:W281)","v":0},{"$f":"SUM(X$3:X281)","v":0},{"$f":"SUM(Y$3:Y281)","v":0},{"$f":"SUM(Z$3:Z281)","v":0},{"$f":"SUM(AA$3:AA281)","v":0},{"$f":"SUM(AB$3:AB281)","v":0}]
[32,"Sa 15:30",1,null,null,null,null,null,null,null,null,null,null,null,null,null,null,null,null,null,null,null,null,null,null,null,null,null,{"$f":"SUM(W$156:W282)","v":0},{"$f":"SUM(X$156:X282)","v":0},{"$f":"SUM(Y$156:Y282)","v":0},{"$f":"SUM(Z$156:Z282)","v":0},{"$f":"SUM(AA$156:AA282)","v":0},{"$f":"SUM(AB$156:AB282)","v":0},{"$f":"SUM(W$3:W282)","v":0},{"$f":"SUM(X$3:X282)","v":0},{"$f":"SUM(Y$3:Y282)","v":0},{"$f":"SUM(Z$3:Z282)","v":0},{"$f":"SUM(AA$3:AA282)","v":0},{"$f":"SUM(AB$3:AB282)","v":0}]
[32,"Sa 15:30",2,null,null,null,null,null,null,null,null,null,null,null,null,null,null,null,null,null,null,null,null,null,null,null,null,null,{"$f":"SUM(W$156:W283)","v":0},{"$f":"SUM(X$156:X283)","v":0},{"$f":"SUM(Y$156:Y283)","v":0},{"$f":"SUM(Z$156:Z283)","v":0},{"$f":"SUM(AA$156:AA283)","v":0},{"$f":"SUM(AB$156:AB283)","v":0},{"$f":"SUM(W$3:W283)","v":0},{"$f":"SUM(X$3:X283)","v":0},{"$f":"SUM(Y$3:Y283)","v":0},{"$f":"SUM(Z$3:Z283)","v":0},{"$f":"SUM(AA$3:AA283)","v":0},{"$f":"SUM(AB$3:AB283)","v":0}]
[32,"Sa 15:30",3,null,null,null,null,null,null,null,null,null,null,null,null,null,null,null,null,null,null,null,null,null,null,null,null,null,{"$f":"SUM(W$156:W284)","v":0},{"$f":"SUM(X$156:X284)","v":0},{"$f":"SUM(Y$156:Y284)","v":0},{"$f":"SUM(Z$156:Z284)","v":0},{"$f":"SUM(AA$156:AA284)","v":0},{"$f":"SUM(AB$156:AB284)","v":0},{"$f":"SUM(W$3:W284)","v":0},{"$f":"SUM(X$3:X284)","v":0},{"$f":"SUM(Y$3:Y284)","v":0},{"$f":"SUM(Z$3:Z284)","v":0},{"$f":"SUM(AA$3:AA284)","v":0},{"$f":"SUM(AB$3:AB284)","v":0}]
[32,"Sa 15:30",4,null,null,null,null,null,null,null,null,null,null,null,null,null,null,null,null,null,null,null,null,null,null,null,null,null,{"$f":"SUM(W$156:W285)","v":0},{"$f":"SUM(X$156:X285)","v":0},{"$f":"SUM(Y$156:Y285)","v":0},{"$f":"SUM(Z$156:Z285)","v":0},{"$f":"SUM(AA$156:AA285)","v":0},{"$f":"SUM(AB$156:AB285)","v":0},{"$f":"SUM(W$3:W285)","v":0},{"$f":"SUM(X$3:X285)","v":0},{"$f":"SUM(Y$3:Y285)","v":0},{"$f":"SUM(Z$3:Z285)","v":0},{"$f":"SUM(AA$3:AA285)","v":0},{"$f":"SUM(AB$3:AB285)","v":0}]
[32,"Sa 15:30",5,null,null,null,null,null,null,null,null,null,null,null,null,null,null,null,null,null,null,null,null,null,null,null,null,null,{"$f":"SUM(W$156:W286)","v":0},{"$f":"SUM(X$156:X286)","v":0},{"$f":"SUM(Y$156:Y286)","v":0},{"$f":"SUM(Z$156:Z286)","v":0},{"$f":"SUM(AA$156:AA286)","v":0},{"$f":"SUM(AB$156:AB286)","v":0},{"$f":"SUM(W$3:W286)","v":0},{"$f":"SUM(X$3:X286)","v":0},{"$f":"SUM(Y$3:Y286)","v":0},{"$f":"SUM(Z$3:Z286)","v":0},{"$f":"SUM(AA$3:AA286)","v":0},{"$f":"SUM(AB$3:AB286)","v":0}]
[32,"Sa 18:30",6,null,null,null,null,null,null,null,null,null,null,null,null,null,null,null,null,null,null,null,null,null,null,null,null,null,{"$f":"SUM(W$156:W287)","v":0},{"$f":"SUM(X$156:X287)","v":0},{"$f":"SUM(Y$156:Y287)","v":0},{"$f":"SUM(Z$156:Z287)","v":0},{"$f":"SUM(AA$156:AA287)","v":0},{"$f":"SUM(AB$156:AB287)","v":0},{"$f":"SUM(W$3:W287)","v":0},{"$f":"SUM(X$3:X287)","v":0},{"$f":"SUM(Y$3:Y287)","v":0},{"$f":"SUM(Z$3:Z287)","v":0},{"$f":"SUM(AA$3:AA287)","v":0},{"$f":"SUM(AB$3:AB287)","v":0}]
[32,"So 15:30",7,null,null,null,null,null,null,null,null,null,null,null,null,null,null,null,null,null,null,null,null,null,null,null,null,null,{"$f":"SUM(W$156:W288)","v":0},{"$f":"SUM(X$156:X288)","v":0},{"$f":"SUM(Y$156:Y288)","v":0},{"$f":"SUM(Z$156:Z288)","v":0},{"$f":"SUM(AA$156:AA288)","v":0},{"$f":"SUM(AB$156:AB288)","v":0},{"$f":"SUM(W$3:W288)","v":0},{"$f":"SUM(X$3:X288)","v":0},{"$f":"SUM(Y$3:Y288)","v":0},{"$f":"SUM(Z$3:Z288)","v":0},{"$f":"SUM(AA$3:AA288)","v":0},{"$f":"SUM(AB$3:AB288)","v":0}]
[32,"So 17:30",8,null,null,null,null,null,null,null,null,null,null,null,null,null,null,null,null,null,null,null,null,null,null,null,null,null,{"$f":"SUM(W$156:W289)","v":0},{"$f":"SUM(X$156:X289)","v":0},{"$f":"SUM(Y$156:Y289)","v":0},{"$f":"SUM(Z$156:Z289)","v":0},{"$f":"SUM(AA$156:AA289)","v":0},{"$f":"SUM(AB$156:AB289)","v":0},{"$f":"SUM(W$3:W289)","v":0},{"$f":"SUM(X$3:X289)","v":0},{"$f":"SUM(Y$3:Y289)","v":0},{"$f":"SUM(Z$3:Z289)","v":0},{"$f":"SUM(AA$3:AA289)","v":0},{"$f":"SUM(AB$3:AB289)","v":0}]
[32,"So 19:30",9,null,null,null,null,null,null,null,null,null,null,null,null,null,null,null,null,null,null,null,null,null,null,null,null,null,{"$f":"SUM(W$156:W290)","v":0},{"$f":"SUM(X$156:X290)","v":0},{"$f":"SUM(Y$156:Y290)","v":0},{"$f":"SUM(Z$156:Z290)","v":0},{"$f":"SUM(AA$156:AA290)","v":0},{"$f":"SUM(AB$156:AB290)","v":0},{"$f":"SUM(W$3:W290)","v":0},{"$f":"SUM(X$3:X290)","v":0},{"$f":"SUM(Y$3:Y290)","v":0},{"$f":"SUM(Z$3:Z290)","v":0},{"$f":"SUM(AA$3:AA290)","v":0},{"$f":"SUM(AB$3:AB290)","v":0}]
[33,"Fr 20:30",1,null,null,null,null,null,null,null,null,null,null,null,null,null,null,null,null,null,null,null,null,null,null,null,null,null,{"$f":"SUM(W$156:W291)","v":0},{"$f":"SUM(X$156:X291)","v":0},{"$f":"SUM(Y$156:Y291)","v":0},{"$f":"SUM(Z$156:Z291)","v":0},{"$f":"SUM(AA$156:AA291)","v":0},{"$f":"SUM(AB$156:AB291)","v":0},{"$f":"SUM(W$3:W291)","v":0},{"$f":"SUM(X$3:X291)","v":0},{"$f":"SUM(Y$3:Y291)","v":0},{"$f":"SUM(Z$3:Z291)","v":0},{"$f":"SUM(AA$3:AA291)","v":0},{"$f":"SUM(AB$3:AB291)","v":0}]
[33,"Sa 15:30",2,null,null,null,null,null,null,null,null,null,null,null,null,null,null,null,null,null,null,null,null,null,null,null,null,null,{"$f":"SUM(W$156:W292)","v":0},{"$f":"SUM(X$156:X292)","v":0},{"$f":"SUM(Y$156:Y292)","v":0},{"$f":"SUM(Z$156:Z292)","v":0},{"$f":"SUM(AA$156:AA292)","v":0},{"$f":"SUM(AB$156:AB292)","v":0},{"$f":"SUM(W$3:W292)","v":0},{"$f":"SUM(X$3:X292)","v":0},{"$f":"SUM(Y$3:Y292)","v":0},{"$f":"SUM(Z$3:Z292)","v":0},{"$f":"SUM(AA$3:AA292)","v":0},{"$f":"SUM(AB$3:AB292)","v":0}]
[33,"Sa 15:30",3,null,null,null,null,null,null,null,null,null,null,null,null,null,null,null,null,null,null,null,null,null,null,null,null,null,{"$f":"SUM(W$156:W293)","v":0},{"$f":"SUM(X$156:X293)","v":0},{"$f":"SUM(Y$156:Y293)","v":0},{"$f":"SUM(Z$156:Z293)","v":0},{"$f":"SUM(AA$156:AA293)","v":0},{"$f":"SUM(AB$156:AB293)","v":0},{"$f":"SUM(W$3:W293)","v":0},{"$f":"SUM(X$3:X293)","v":0},{"$f":"SUM(Y$3:Y293)","v":0},{"$f":"SUM(Z$3:Z293)","v":0},{"$f":"SUM(AA$3:AA293)","v":0},{"$f":"SUM(AB$3:AB293)","v":0}]
[33,"Sa 15:30",4,null,null,null,null,null,null,null,null,null,null,null,null,null,null,null,null,null,null,null,null,null,null,null,null,null,{"$f":"SUM(W$156:W294)","v":0},{"$f":"SUM(X$156:X294)","v":0},{"$f":"SUM(Y$156:Y294)","v":0},{"$f":"SUM(Z$156:Z294)","v":0},{"$f":"SUM(AA$156:AA294)","v":0},{"$f":"SUM(AB$156:AB294)","v":0},{"$f":"SUM(W$3:W294)","v":0},{"$f":"SUM(X$3:X294)","v":0},{"$f":"SUM(Y$3:Y294)","v":0},{"$f":"SUM(Z$3:Z294)","v":0},{"$f":"SUM(AA$3:AA294)","v":0},{"$f":"SUM(AB$3:AB294)","v":0}]
[33,"Sa 15:30",5,null,null,null,null,null,null,null,null,null,null,null,null,null,null,null,null,null,null,null,null,null,null,null,null,null,{"$f":"SUM(W$156:W295)","v":0},{"$f":"SUM(X$156:X295)","v":0},{"$f":"SUM(Y$156:Y295)","v":0},{"$f":"SUM(Z$156:Z295)","v":0},{"$f":"SUM(AA$156:AA295)","v":0},{"$f":"SUM(AB$156:AB295)","v":0},{"$f":"SUM(W$3:W295)","v":0},{"$f":"SUM(X$3:X295)","v":0},{"$f":"SUM(Y$3:Y295)","v":0},{"$f":"SUM(Z$3:Z295)","v":0},{"$f":"SUM(AA$3:AA295)","v":0},{"$f":"SUM(AB$3:AB295)","v":0}]
[33,"Sa 18:30",6,null,null,null,null,null,null,null,null,null,null,null,null,null,null,null,null,null,null,null,null,null,null,null,null,null,{"$f":"SUM(W$156:W296)","v":0},{"$f":"SUM(X$156:X296)","v":0},{"$f":"SUM(Y$156:Y296)","v":0},{"$f":"SUM(Z$156:Z296)","v":0},{"$f":"SUM(AA$156:AA296)","v":0},{"$f":"SUM(AB$156:AB296)","v":0},{"$f":"SUM(W$3:W296)","v":0},{"$f":"SUM(X$3:X296)","v":0},{"$f":"SUM(Y$3:Y296)","v":0},{"$f":"SUM(Z$3:Z296)","v":0},{"$f":"SUM(AA$3:AA296)","v":0},{"$f":"SUM(AB$3:AB296)","v":0}]
[33,"So 15:30",7,null,null,null,null,null,null,null,null,null,null,null,null,null,null,null,null,null,null,null,null,null,null,null,null,null,{"$f":"SUM(W$156:W297)","v":0},{"$f":"SUM(X$156:X297)","v":0},{"$f":"SUM(Y$156:Y297)","v":0},{"$f":"SUM(Z$156:Z297)","v":0},{"$f":"SUM(AA$156:AA297)","v":0},{"$f":"SUM(AB$156:AB297)","v":0},{"$f":"SUM(W$3:W297)","v":0},{"$f":"SUM(X$3:X297)","v":0},{"$f":"SUM(Y$3:Y297)","v":0},{"$f":"SUM(Z$3:Z297)","v":0},{"$f":"SUM(AA$3:AA297)","v":0},{"$f":"SUM(AB$3:AB297)","v":0}]
[33,"So 17:30",8,null,null,null,null,null,null,null,null,null,null,null,null,null,null,null,null,null,null,null,null,null,null,null,null,null,{"$f":"SUM(W$156:W298)","v":0},{"$f":"SUM(X$156:X298)","v":0},{"$f":"SUM(Y$156:Y298)","v":0},{"$f":"SUM(Z$156:Z298)","v":0},{"$f":"SUM(AA$156:AA298)","v":0},{"$f":"SUM(AB$156:AB298)","v":0},{"$f":"SUM(W$3:W298)","v":0},{"$f":"SUM(X$3:X298)","v":0},{"$f":"SUM(Y$3:Y298)","v":0},{"$f":"SUM(Z$3:Z298)","v":0},{"$f":"SUM(AA$3:AA298)","v":0},{"$f":"SUM(AB$3:AB298)","v":0}]
[33,"So 19:30",9,null,null,null,null,null,null,null,null,null,null,null,null,null,null,null,null,null,null,null,null,null,null,null,null,null,{"$f":"SUM(W$156:W299)","v":0},{"$f":"SUM(X$156:X299)","v":0},{"$f":"SUM(Y$156:Y299)","v":0},{"$f":"SUM(Z$156:Z299)","v":0},{"$f":"SUM(AA$156:AA299)","v":0},{"$f":"SUM(AB$156:AB299)","v":0},{"$f":"SUM(W$3:W299)","v":0},{"$f":"SUM(X$3:X299)","v":0},{"$f":"SUM(Y$3:Y299)","v":0},{"$f":"SUM(Z$3:Z299)","v":0},{"$f":"SUM(AA$3:AA299)","v":0},{"$f":"SUM(AB$3:AB299)","v":0}]
[34,"Sa 15:30",1,null,null,null,null,null,null,null,null,null,null,null,null,null,null,null,null,null,null,null,null,null,null,null,null,null,{"$f":"SUM(W$156:W300)","v":0},{"$f":"SUM(X$156:X300)","v":0},{"$f":"SUM(Y$156:Y300)","v":0},{"$f":"SUM(Z$156:Z300)","v":0},{"$f":"SUM(AA$156:AA300)","v":0},{"$f":"SUM(AB$156:AB300)","v":0},{"$f":"SUM(W$3:W300)","v":0},{"$f":"SUM(X$3:X300)","v":0},{"$f":"SUM(Y$3:Y300)","v":0},{"$f":"SUM(Z$3:Z300)","v":0},{"$f":"SUM(AA$3:AA300)","v":0},{"$f":"SUM(AB$3:AB300)","v":0}]
[34,"Sa 15:30",2,null,null,null,null,null,null,null,null,null,null,null,null,null,null,null,null,null,null,null,null,null,null,null,null,null,{"$f":"SUM(W$156:W301)","v":0},{"$f":"SUM(X$156:X301)","v":0},{"$f":"SUM(Y$156:Y301)","v":0},{"$f":"SUM(Z$156:Z301)","v":0},{"$f":"SUM(AA$156:AA301)","v":0},{"$f":"SUM(AB$156:AB301)","v":0},{"$f":"SUM(W$3:W301)","v":0},{"$f":"SUM(X$3:X301)","v":0},{"$f":"SUM(Y$3:Y301)","v":0},{"$f":"SUM(Z$3:Z301)","v":0},{"$f":"SUM(AA$3:AA301)","v":0},{"$f":"SUM(AB$3:AB301)","v":0}]
[34,"Sa 15:30",3,null,null,null,null,null,null,null,null,null,null,null,null,null,null,null,null,null,null,null,null,null,null,null,null,null,{"$f":"SUM(W$156:W302)","v":0},{"$f":"SUM(X$156:X302)","v":0},{"$f":"SUM(Y$156:Y302)","v":0},{"$f":"SUM(Z$156:Z302)","v":0},{"$f":"SUM(AA$156:AA302)","v":0},{"$f":"SUM(AB$156:AB302)","v":0},{"$f":"SUM(W$3:W302)","v":0},{"$f":"SUM(X$3:X302)","v":0},{"$f":"SUM(Y$3:Y302)","v":0},{"$f":"SUM(Z$3:Z302)","v":0},{"$f":"SUM(AA$3:AA302)","v":0},{"$f":"SUM(AB$3:AB302)","v":0}]
[34,"Sa 15:30",4,null,null,null,null,null,null,null,null,null,null,null,null,null,null,null,null,null,null,null,null,null,null,null,null,null,{"$f":"SUM(W$156:W303)","v":0},{"$f":"SUM(X$156:X303)","v":0},{"$f":"SUM(Y$156:Y303)","v":0},{"$f":"SUM(Z$156:Z303)","v":0},{"$f":"SUM(AA$156:AA303)","v":0},{"$f":"SUM(AB$156:AB303)","v":0},{"$f":"SUM(W$3:W303)","v":0},{"$f":"SUM(X$3:X303)","v":0},{"$f":"SUM(Y$3:Y303)","v":0},{"$f":"SUM(Z$3:Z303)","v":0},{"$f":"SUM(AA$3:AA303)","v":0},{"$f":"SUM(AB$3:AB303)","v":0}]
[34,"Sa 15:30",5,null,null,null,null,null,null,null,null,null,null,null,null,null,null,null,null,null,null,null,null,null,null,null,null,null,{"$f":"SUM(W$156:W304)","v":0},{"$f":"SUM(X$156:X304)","v":0},{"$f":"SUM(Y$156:Y304)","v":0},{"$f":"SUM(Z$156:Z304)","v":0},{"$f":"SUM(AA$156:AA304)","v":0},{"$f":"SUM(AB$156:AB304)","v":0},{"$f":"SUM(W$3:W304)","v":0},{"$f":"SUM(X$3:X304)","v":0},{"$f":"SUM(Y$3:Y304)","v":0},{"$f":"SUM(Z$3:Z304)","v":0},{"$f":"SUM(AA$3:AA304)","v":0},{"$f":"SUM(AB$3:AB304)","v":0}]
[34,"Sa 15:30",6,null,null,null,null,null,null,null,null,null,null,null,null,null,null,null,null,null,null,null,null,null,null,null,null,null,{"$f":"SUM(W$156:W305)","v":0},{"$f":"SUM(X$156:X305)","v":0},{"$f":"SUM(Y$156:Y305)","v":0},{"$f":"SUM(Z$156:Z305)","v":0},{"$f":"SUM(AA$156:AA305)","v":0},{"$f":"SUM(AB$156:AB305)","v":0},{"$f":"SUM(W$3:W305)","v":0},{"$f":"SUM(X$3:X305)","v":0},{"$f":"SUM(Y$3:Y305)","v":0},{"$f":"SUM(Z$3:Z305)","v":0},{"$f":"SUM(AA$3:AA305)","v":0},{"$f":"SUM(AB$3:AB305)","v":0}]
[34,"Sa 15:30",7,null,null,null,null,null,null,null,null,null,null,null,null,null,null,null,null,null,null,null,null,null,null,null,null,null,{"$f":"SUM(W$156:W306)","v":0},{"$f":"SUM(X$156:X306)","v":0},{"$f":"SUM(Y$156:Y306)","v":0},{"$f":"SUM(Z$156:Z306)","v":0},{"$f":"SUM(AA$156:AA306)","v":0},{"$f":"SUM(AB$156:AB306)","v":0},{"$f":"SUM(W$3:W306)","v":0},{"$f":"SUM(X$3:X306)","v":0},{"$f":"SUM(Y$3:Y306)","v":0},{"$f":"SUM(Z$3:Z306)","v":0},{"$f":"SUM(AA$3:AA306)","v":0},{"$f":"SUM(AB$3:AB306)","v":0}]
[34,"Sa 15:30",8,null,null,null,null,null,null,null,null,null,null,null,null,null,null,null,null,null,null,null,null,null,null,null,null,null,{"$f":"SUM(W$156:W307)","v":0},{"$f":"SUM(X$156:X307)","v":0},{"$f":"SUM(Y$156:Y307)","v":0},{"$f":"SUM(Z$156:Z307)","v":0},{"$f":"SUM(AA$156:AA307)","v":0},{"$f":"SUM(AB$156:AB307)","v":0},{"$f":"SUM(W$3:W307)","v":0},{"$f":"SUM(X$3:X307)","v":0},{"$f":"SUM(Y$3:Y307)","v":0},{"$f":"SUM(Z$3:Z307)","v":0},{"$f":"SUM(AA$3:AA307)","v":0},{"$f":"SUM(AB$3:AB307)","v":0}]
[34,"Sa 15:30",9,null,null,null,null,null,null,null,null,null,null,null,null,null,null,null,null,null,null,null,null,null,null,null,null,null,{"$f":"SUM(W$156:W308)","v":0},{"$f":"SUM(X$156:X308)","v":0},{"$f":"SUM(Y$156:Y308)","v":0},{"$f":"SUM(Z$156:Z308)","v":0},{"$f":"SUM(AA$156:AA308)","v":0},{"$f":"SUM(AB$156:AB308)","v":0},{"$f":"SUM(W$3:W308)","v":0},{"$f":"SUM(X$3:X308)","v":0},{"$f":"SUM(Y$3:Y308)","v":0},{"$f":"SUM(Z$3:Z308)","v":0},{"$f":"SUM(AA$3:AA308)","v":0},{"$f":"SUM(AB$3:AB308)","v":0}]

{"sheet":"Seidl","index":2,"n_rows":23,"n_cols":23,"rows_kept":23,"cut":false,"hidden":false,"merged":[[0,8,0,14],[0,0,0,6],[0,16,0,22]]}
["Herbst",null,null,null,null,null,null,null,"Frühjahr",null,null,null,null,null,null,null,{"$f":"Parameter!B15","v":"26/27"}]
["Runde",{"$f":"Parameter!C1","v":"MA"},{"$f":"Parameter!D1","v":"MN"},{"$f":"Parameter!E1","v":"AH"},{"$f":"Parameter!F1","v":"KS"},{"$f":"Parameter!G1","v":"LM"},{"$f":"Parameter!H1","v":"EN"},null,"Runde",{"$f":"Parameter!C1","v":"MA"},{"$f":"Parameter!D1","v":"MN"},{"$f":"Parameter!E1","v":"AH"},{"$f":"Parameter!F1","v":"KS"},{"$f":"Parameter!G1","v":"LM"},{"$f":"Parameter!H1","v":"EN"},null,"Runde",{"$f":"Parameter!C1","v":"MA"},{"$f":"Parameter!D1","v":"MN"},{"$f":"Parameter!E1","v":"AH"},{"$f":"Parameter!F1","v":"KS"},{"$f":"Parameter!G1","v":"LM"},{"$f":"Parameter!H1","v":"EN"}]
[1,null,null,null,null,null,null,null,18,null,null,null,null,null,null,null,"Tot",{"$f":"B20+J20","v":0},0,0,0,0,0]
[2,null,null,null,null,null,null,null,19]
[3,null,null,null,null,null,null,null,20]
[4,null,null,null,null,null,null,null,21]
[5,null,null,null,null,null,null,null,22]
[6,null,null,null,null,null,null,null,23]
[7,null,null,null,null,null,null,null,24]
[8,null,null,null,null,null,null,null,25]
[9,null,null,null,null,null,null,null,26]
[10,null,null,null,null,null,null,null,27]
[11,null,null,null,null,null,null,null,28]
[12,null,null,null,null,null,null,null,29]
[13,null,null,null,null,null,null,null,30]
[14,null,null,null,null,null,null,null,31]
[15,null,null,null,null,null,null,null,32]
[16,null,null,null,null,null,null,null,33]
[17,null,null,null,null,null,null,null,34]
["Tot",{"$f":"SUM(B3:B19)","v":0},0,0,0,0,0,null,"Tot",{"$f":"SUM(J3:J19)","v":0},0,0,0,0,0]
[]
["plus",{"$f":"SUMIF(B3:B19,\">0\",B3:B19)","v":0},0,0,0,0,0,null,"plus",{"$f":"SUMIF(J3:J19,\">0\",J3:J19)","v":0},0,0,0,0,0,null,"plus",{"$f":"B22+J22","v":0},0,0,0,0,0]
["minus",{"$f":"-SUMIF(B3:B19,\"<0\",B3:B19)","v":0},0,0,0,0,0,null,"minus",{"$f":"-SUMIF(J3:J19,\"<0\",J3:J19)","v":0},0,0,0,0,0,null,"minus",0,0,0,0,0,0]

{"sheet":"Übersicht","index":3,"n_rows":87,"n_cols":49,"rows_kept":87,"cut":false,"hidden":false,"merged":[[60,42,60,47],[57,42,57,47],[23,34,23,39],[1,2,1,9],[1,11,1,18],[14,42,14,47],[1,27,1,32],[23,2,23,9],[23,20,23,25],[23,27,23,32],[17,42,17,47],[36,42,36,47],[39,42,39,47],[1,1,2,1],[1,34,1,39],[1,20,1,25],[45,1,46,1],[45,27,45,32],[23,11,23,18],[45,20,45,25],[45,2,45,9],[45,11,45,18],[23,1,24,1],[45,34,45,39]]}
[]
[null,"Herbst","Punkte einzeln",null,null,null,null,null,null,null,null,"Punkte kumulativ",null,null,null,null,null,null,null,null,"Rang einzeln",null,null,null,null,null,null,"Rang kumulativ",null,null,null,null,null,null,"Differenz zum Ersten",null,null,null,null,null,null,"Herbst",{"$f":"Parameter!$C$1","v":"MA"},{"$f":"Parameter!$D$1","v":"MN"},{"$f":"Parameter!$E$1","v":"AH"},{"$f":"Parameter!$F$1","v":"KS"},{"$f":"Parameter!$G$1","v":"LM"},{"$f":"Parameter!$H$1","v":"EN"}]
[null,null,{"$f":"Parameter!$C$1","v":"MA"},{"$f":"Parameter!$D$1","v":"MN"},{"$f":"Parameter!$E$1","v":"AH"},{"$f":"Parameter!$F$1","v":"KS"},{"$f":"Parameter!$G$1","v":"LM"},{"$f":"Parameter!$H$1","v":"EN"},"Max",null,null,{"$f":"Parameter!$C$1","v":"MA"},{"$f":"Parameter!$D$1","v":"MN"},{"$f":"Parameter!$E$1","v":"AH"},{"$f":"Parameter!$F$1","v":"KS"},{"$f":"Parameter!$G$1","v":"LM"},{"$f":"Parameter!$H$1","v":"EN"},"Max",null,null,{"$f":"Parameter!$C$1","v":"MA"},{"$f":"Parameter!$D$1","v":"MN"},{"$f":"Parameter!$E$1","v":"AH"},{"$f":"Parameter!$F$1","v":"KS"},{"$f":"Parameter!$G$1","v":"LM"},{"$f":"Parameter!$H$1","v":"EN"},null,{"$f":"Parameter!$C$1","v":"MA"},{"$f":"Parameter!$D$1","v":"MN"},{"$f":"Parameter!$E$1","v":"AH"},{"$f":"Parameter!$F$1","v":"KS"},{"$f":"Parameter!$G$1","v":"LM"},{"$f":"Parameter!$H$1","v":"EN"},null,{"$f":"Parameter!$C$1","v":"MA"},{"$f":"Parameter!$D$1","v":"MN"},{"$f":"Parameter!$E$1","v":"AH"},{"$f":"Parameter!$F$1","v":"KS"},{"$f":"Parameter!$G$1","v":"LM"},{"$f":"Parameter!$H$1","v":"EN"},null,"Rang",{"$f":"IF(C4>0,RANK(C21,$C$21:$H$21),\"\")","v":""},"","","","",""]
[null,1,0,0,0,0,0,0,{"$f":"MAX(C4:H4)","v":0},null,null,{"$f":"IF($I4=0,0,ROUND(SUM(C$4:C4),1))","v":0},{"$f":"IF($I4=0,0,ROUND(SUM(D$4:D4),1))","v":0},{"$f":"IF($I4=0,0,ROUND(SUM(E$4:E4),1))","v":0},{"$f":"IF($I4=0,0,ROUND(SUM(F$4:F4),1))","v":0},{"$f":"IF($I4=0,0,ROUND(SUM(G$4:G4),1))","v":0},{"$f":"IF($I4=0,0,ROUND(SUM(H$4:H4),1))","v":0},{"$f":"MAX(L4:Q4)","v":0},null,null,{"$f":"IF($I4>0,RANK(C4,$C4:$H4),\"\")","v":""},"","","","","",null,{"$f":"IF($R4>0,RANK(L4,$L4:$Q4),\"\")","v":""},"","","","","",null,{"$f":"L4-$R4","v":0},0,0,0,0,0,null,"Einsatz €",{"$f":"Parameter!C2","v":25},{"$f":"Parameter!D2","v":25},{"$f":"Parameter!E2","v":25},{"$f":"Parameter!F2","v":25},{"$f":"Parameter!G2","v":0},{"$f":"Parameter!H2","v":0}]
[null,2,0,0,0,0,0,0,{"$f":"MAX(C5:H5)","v":0},null,null,{"$f":"IF($I5=0,0,ROUND(SUM(C$4:C5),1))","v":0},{"$f":"IF($I5=0,0,ROUND(SUM(D$4:D5),1))","v":0},{"$f":"IF($I5=0,0,ROUND(SUM(E$4:E5),1))","v":0},{"$f":"IF($I5=0,0,ROUND(SUM(F$4:F5),1))","v":0},{"$f":"IF($I5=0,0,ROUND(SUM(G$4:G5),1))","v":0},{"$f":"IF($I5=0,0,ROUND(SUM(H$4:H5),1))","v":0},{"$f":"MAX(L5:Q5)","v":0},null,null,{"$f":"IF($I5>0,RANK(C5,$C5:$H5),\"\")","v":""},{"$f":"IF($I5>0,RANK(D5,$C5:$H5),\"\")","v":""},{"$f":"IF($I5>0,RANK(E5,$C5:$H5),\"\")","v":""},{"$f":"IF($I5>0,RANK(F5,$C5:$H5),\"\")","v":""},{"$f":"IF($I5>0,RANK(G5,$C5:$H5),\"\")","v":""},{"$f":"IF($I5>0,RANK(H5,$C5:$H5),\"\")","v":""},null,{"$f":"IF($R5>0,RANK(L5,$L5:$Q5),\"\")","v":""},{"$f":"IF($R5>0,RANK(M5,$L5:$Q5),\"\")","v":""},{"$f":"IF($R5>0,RANK(N5,$L5:$Q5),\"\")","v":""},{"$f":"IF($R5>0,RANK(O5,$L5:$Q5),\"\")","v":""},{"$f":"IF($R5>0,RANK(P5,$L5:$Q5),\"\")","v":""},{"$f":"IF($R5>0,RANK(Q5,$L5:$Q5),\"\")","v":""},null,{"$f":"L5-$R5","v":0},{"$f":"M5-$R5","v":0},{"$f":"N5-$R5","v":0},{"$f":"O5-$R5","v":0},{"$f":"P5-$R5","v":0},{"$f":"Q5-$R5","v":0},null,"Anteil €",{"$f":"IF(C4>0,SUM($AQ4:$AV4)*INDEX(Parameter!$B$8:$B$13,Übersicht!AQ3,1),AQ4)","v":25},{"$f":"IF(D4>0,SUM($AQ4:$AV4)*INDEX(Parameter!$B$8:$B$13,Übersicht!AR3,1),AR4)","v":25},{"$f":"IF(E4>0,SUM($AQ4:$AV4)*INDEX(Parameter!$B$8:$B$13,Übersicht!AS3,1),AS4)","v":25},{"$f":"IF(F4>0,SUM($AQ4:$AV4)*INDEX(Parameter!$B$8:$B$13,Übersicht!AT3,1),AT4)","v":25},{"$f":"IF(G4>0,SUM($AQ4:$AV4)*INDEX(Parameter!$B$8:$B$13,Übersicht!AU3,1),AU4)","v":0},{"$f":"IF(H4>0,SUM($AQ4:$AV4)*INDEX(Parameter!$B$8:$B$13,Übersicht!AV3,1),AV4)","v":0}]
[null,3,0,0,0,0,0,0,0,null,null,{"$f":"IF($I6=0,0,ROUND(SUM(C$4:C6),1))","v":0},{"$f":"IF($I6=0,0,ROUND(SUM(D$4:D6),1))","v":0},{"$f":"IF($I6=0,0,ROUND(SUM(E$4:E6),1))","v":0},{"$f":"IF($I6=0,0,ROUND(SUM(F$4:F6),1))","v":0},{"$f":"IF($I6=0,0,ROUND(SUM(G$4:G6),1))","v":0},{"$f":"IF($I6=0,0,ROUND(SUM(H$4:H6),1))","v":0},0,null,null,"","","","","","",null,"","","","","","",null,0,0,0,0,0,0,null,"Gewinn €",{"$f":"AQ5-AQ4","v":0},0,0,0,0,0]
[null,4,0,0,0,0,0,0,0,null,null,{"$f":"IF($I7=0,0,ROUND(SUM(C$4:C7),1))","v":0},{"$f":"IF($I7=0,0,ROUND(SUM(D$4:D7),1))","v":0},{"$f":"IF($I7=0,0,ROUND(SUM(E$4:E7),1))","v":0},{"$f":"IF($I7=0,0,ROUND(SUM(F$4:F7),1))","v":0},{"$f":"IF($I7=0,0,ROUND(SUM(G$4:G7),1))","v":0},{"$f":"IF($I7=0,0,ROUND(SUM(H$4:H7),1))","v":0},0,null,null,"","","","","","",null,"","","","","","",null,0,0,0,0,0,0,null,"Siege",{"$f":"SUMIF(U4:U20,\"=1\",U4:U20)","v":0},0,0,0,0,0]
[null,5,0,0,0,0,0,0,0,null,null,{"$f":"IF($I8=0,0,ROUND(SUM(C$4:C8),1))","v":0},{"$f":"IF($I8=0,0,ROUND(SUM(D$4:D8),1))","v":0},{"$f":"IF($I8=0,0,ROUND(SUM(E$4:E8),1))","v":0},{"$f":"IF($I8=0,0,ROUND(SUM(F$4:F8),1))","v":0},{"$f":"IF($I8=0,0,ROUND(SUM(G$4:G8),1))","v":0},{"$f":"IF($I8=0,0,ROUND(SUM(H$4:H8),1))","v":0},0,null,null,"","","","","","",null,"","","","","","",null,0,0,0,0,0,0,null,"Seidl ",{"$f":"Seidl!B20","v":0},{"$f":"Seidl!C20","v":0},{"$f":"Seidl!D20","v":0},{"$f":"Seidl!E20","v":0},{"$f":"Seidl!F20","v":0},{"$f":"Seidl!G20","v":0}]
[null,6,0,0,0,0,0,0,0,null,null,{"$f":"IF($I9=0,0,ROUND(SUM(C$4:C9),1))","v":0},{"$f":"IF($I9=0,0,ROUND(SUM(D$4:D9),1))","v":0},{"$f":"IF($I9=0,0,ROUND(SUM(E$4:E9),1))","v":0},{"$f":"IF($I9=0,0,ROUND(SUM(F$4:F9),1))","v":0},{"$f":"IF($I9=0,0,ROUND(SUM(G$4:G9),1))","v":0},{"$f":"IF($I9=0,0,ROUND(SUM(H$4:H9),1))","v":0},0,null,null,"","","","","","",null,"","","","","","",null,0,0,0,0,0,0,null,"Seidl €",{"$f":"AQ8*Parameter!$B$16","v":0},{"$f":"AR8*Parameter!$B$16","v":0},{"$f":"AS8*Parameter!$B$16","v":0},{"$f":"AT8*Parameter!$B$16","v":0},{"$f":"AU8*Parameter!$B$16","v":0},{"$f":"AV8*Parameter!$B$16","v":0}]
[null,7,0,0,0,0,0,0,0,null,null,{"$f":"IF($I10=0,0,ROUND(SUM(C$4:C10),1))","v":0},{"$f":"IF($I10=0,0,ROUND(SUM(D$4:D10),1))","v":0},{"$f":"IF($I10=0,0,ROUND(SUM(E$4:E10),1))","v":0},{"$f":"IF($I10=0,0,ROUND(SUM(F$4:F10),1))","v":0},{"$f":"IF($I10=0,0,ROUND(SUM(G$4:G10),1))","v":0},{"$f":"IF($I10=0,0,ROUND(SUM(H$4:H10),1))","v":0},0,null,null,"","","","","","",null,"","","","","","",null,0,0,0,0,0,0,null,null,{"$f":"RANK(AQ9,$AQ9:$AT9)","v":1},{"$f":"RANK(AR9,$AQ9:$AT9)","v":1},{"$f":"RANK(AS9,$AQ9:$AT9)","v":1},{"$f":"RANK(AT9,$AQ9:$AT9)","v":1},0,0]
[null,8,0,0,0,0,0,0,0,null,null,{"$f":"IF($I11=0,0,ROUND(SUM(C$4:C11),1))","v":0},{"$f":"IF($I11=0,0,ROUND(SUM(D$4:D11),1))","v":0},{"$f":"IF($I11=0,0,ROUND(SUM(E$4:E11),1))","v":0},{"$f":"IF($I11=0,0,ROUND(SUM(F$4:F11),1))","v":0},{"$f":"IF($I11=0,0,ROUND(SUM(G$4:G11),1))","v":0},{"$f":"IF($I11=0,0,ROUND(SUM(H$4:H11),1))","v":0},0,null,null,"","","",{"$f":"IF($I11>0,RANK(F11,$C11:$H11),\"\")","v":""},"","",null,"","","","","","",null,0,0,0,0,0,0,null,"Herbst  €",{"$f":"AQ6+AQ9","v":0},0,0,0,0,0]
[null,9,0,0,0,0,0,0,0,null,null,{"$f":"IF($I12=0,0,ROUND(SUM(C$4:C12),1))","v":0},{"$f":"IF($I12=0,0,ROUND(SUM(D$4:D12),1))","v":0},{"$f":"IF($I12=0,0,ROUND(SUM(E$4:E12),1))","v":0},{"$f":"IF($I12=0,0,ROUND(SUM(F$4:F12),1))","v":0},{"$f":"IF($I12=0,0,ROUND(SUM(G$4:G12),1))","v":0},{"$f":"IF($I12=0,0,ROUND(SUM(H$4:H12),1))","v":0},0,null,null,"","","","","","",null,"","","","","","",null,0,0,0,0,0,0,null,null,{"$f":"IF(AQ4>0,RANK(AQ11,$AQ11:$AT11),0)","v":1},1,1,1,0,0]
[null,10,0,0,0,0,0,0,0,null,null,{"$f":"IF($I13=0,0,ROUND(SUM(C$4:C13),1))","v":0},{"$f":"IF($I13=0,0,ROUND(SUM(D$4:D13),1))","v":0},{"$f":"IF($I13=0,0,ROUND(SUM(E$4:E13),1))","v":0},{"$f":"IF($I13=0,0,ROUND(SUM(F$4:F13),1))","v":0},{"$f":"IF($I13=0,0,ROUND(SUM(G$4:G13),1))","v":0},{"$f":"IF($I13=0,0,ROUND(SUM(H$4:H13),1))","v":0},0,null,null,"","","","","","",null,"","","","","","",null,0,0,0,0,0,0]
[null,11,0,0,0,0,0,0,0,null,null,{"$f":"IF($I14=0,0,ROUND(SUM(C$4:C14),1))","v":0},{"$f":"IF($I14=0,0,ROUND(SUM(D$4:D14),1))","v":0},{"$f":"IF($I14=0,0,ROUND(SUM(E$4:E14),1))","v":0},{"$f":"IF($I14=0,0,ROUND(SUM(F$4:F14),1))","v":0},{"$f":"IF($I14=0,0,ROUND(SUM(G$4:G14),1))","v":0},{"$f":"IF($I14=0,0,ROUND(SUM(H$4:H14),1))","v":0},0,null,null,"","","","","","",null,"","","","","","",null,0,0,0,0,0,0]
[null,12,0,0,0,0,0,0,0,null,null,{"$f":"IF($I15=0,0,ROUND(SUM(C$4:C15),1))","v":0},{"$f":"IF($I15=0,0,ROUND(SUM(D$4:D15),1))","v":0},{"$f":"IF($I15=0,0,ROUND(SUM(E$4:E15),1))","v":0},{"$f":"IF($I15=0,0,ROUND(SUM(F$4:F15),1))","v":0},{"$f":"IF($I15=0,0,ROUND(SUM(G$4:G15),1))","v":0},{"$f":"IF($I15=0,0,ROUND(SUM(H$4:H15),1))","v":0},0,null,null,"","","","","","",null,"","","","","","",null,0,0,0,0,0,0,null,null,"Maximale Punkte"]
[null,13,0,0,0,0,0,0,0,null,null,{"$f":"IF($I16=0,0,ROUND(SUM(C$4:C16),1))","v":0},{"$f":"IF($I16=0,0,ROUND(SUM(D$4:D16),1))","v":0},{"$f":"IF($I16=0,0,ROUND(SUM(E$4:E16),1))","v":0},{"$f":"IF($I16=0,0,ROUND(SUM(F$4:F16),1))","v":0},{"$f":"IF($I16=0,0,ROUND(SUM(G$4:G16),1))","v":0},{"$f":"IF($I16=0,0,ROUND(SUM(H$4:H16),1))","v":0},0,null,null,"","","","","","",null,"","","","","","",null,0,0,0,0,0,0,null,null,{"$f":"Parameter!$C$1","v":"MA"},{"$f":"Parameter!$D$1","v":"MN"},{"$f":"Parameter!$E$1","v":"AH"},{"$f":"Parameter!$F$1","v":"KS"},{"$f":"Parameter!$G$1","v":"LM"},{"$f":"Parameter!$H$1","v":"EN"}]
[null,14,0,0,0,0,0,0,0,null,null,{"$f":"IF($I17=0,0,ROUND(SUM(C$4:C17),1))","v":0},{"$f":"IF($I17=0,0,ROUND(SUM(D$4:D17),1))","v":0},{"$f":"IF($I17=0,0,ROUND(SUM(E$4:E17),1))","v":0},{"$f":"IF($I17=0,0,ROUND(SUM(F$4:F17),1))","v":0},{"$f":"IF($I17=0,0,ROUND(SUM(G$4:G17),1))","v":0},{"$f":"IF($I17=0,0,ROUND(SUM(H$4:H17),1))","v":0},0,null,null,"","","","","","",null,"","","","","","",null,0,0,0,0,0,0,null,null,{"$f":"MAX(C4:C20)","v":0},0,0,0,0,0]
[null,15,0,0,0,0,0,0,0,null,null,{"$f":"IF($I18=0,0,ROUND(SUM(C$4:C18),1))","v":0},{"$f":"IF($I18=0,0,ROUND(SUM(D$4:D18),1))","v":0},{"$f":"IF($I18=0,0,ROUND(SUM(E$4:E18),1))","v":0},{"$f":"IF($I18=0,0,ROUND(SUM(F$4:F18),1))","v":0},{"$f":"IF($I18=0,0,ROUND(SUM(G$4:G18),1))","v":0},{"$f":"IF($I18=0,0,ROUND(SUM(H$4:H18),1))","v":0},0,null,null,"","","","","","",null,"","","","","","",null,0,0,0,0,0,0,null,null,"Minimale Punkte"]
[null,16,0,0,0,0,0,0,0,null,null,{"$f":"IF($I19=0,0,ROUND(SUM(C$4:C19),1))","v":0},{"$f":"IF($I19=0,0,ROUND(SUM(D$4:D19),1))","v":0},{"$f":"IF($I19=0,0,ROUND(SUM(E$4:E19),1))","v":0},{"$f":"IF($I19=0,0,ROUND(SUM(F$4:F19),1))","v":0},{"$f":"IF($I19=0,0,ROUND(SUM(G$4:G19),1))","v":0},{"$f":"IF($I19=0,0,ROUND(SUM(H$4:H19),1))","v":0},0,null,null,"","","","","","",null,"","","","","","",null,0,0,0,0,0,0,null,null,{"$f":"Parameter!$C$1","v":"MA"},{"$f":"Parameter!$D$1","v":"MN"},{"$f":"Parameter!$E$1","v":"AH"},{"$f":"Parameter!$F$1","v":"KS"},{"$f":"Parameter!$G$1","v":"LM"},{"$f":"Parameter!$H$1","v":"EN"}]
[null,17,0,0,0,0,0,0,0,null,null,{"$f":"IF($I20=0,0,ROUND(SUM(C$4:C20),1))","v":0},{"$f":"IF($I20=0,0,ROUND(SUM(D$4:D20),1))","v":0},{"$f":"IF($I20=0,0,ROUND(SUM(E$4:E20),1))","v":0},{"$f":"IF($I20=0,0,ROUND(SUM(F$4:F20),1))","v":0},{"$f":"IF($I20=0,0,ROUND(SUM(G$4:G20),1))","v":0},{"$f":"IF($I20=0,0,ROUND(SUM(H$4:H20),1))","v":0},0,null,null,"","","","","","",null,"","","","","","",null,0,0,0,0,0,0,null,null,0,0,0,0,0,0]
[null,"Herbst",{"$f":"ROUND(SUM(C4:C20),1)","v":0},0,0,0,0,0,0,null,null,null,null,null,null,null,null,null,null,null,{"$f":"SUM(U4:U20)/COUNT(U4:U20)","v":{"$error":"#DIV/0!"}},{"$error":"#DIV/0!"},{"$error":"#DIV/0!"},{"$error":"#DIV/0!"},{"$error":"#DIV/0!"},{"$error":"#DIV/0!"}]
[]
[]
[null,"Frühjahr","Punkte einzeln",null,null,null,null,null,null,null,null,"Punkte kumulativ",null,null,null,null,null,null,null,null,"Rang einzeln",null,null,null,null,null,null,"Rang kumulativ",null,null,null,null,null,null,"Differenz zum Ersten",null,null,null,null,null,null,"Frühjahr",{"$f":"Parameter!$C$1","v":"MA"},{"$f":"Parameter!$D$1","v":"MN"},{"$f":"Parameter!$E$1","v":"AH"},{"$f":"Parameter!$F$1","v":"KS"},{"$f":"Parameter!$G$1","v":"LM"},{"$f":"Parameter!$H$1","v":"EN"}]
[null,null,{"$f":"Parameter!$C$1","v":"MA"},{"$f":"Parameter!$D$1","v":"MN"},{"$f":"Parameter!$E$1","v":"AH"},{"$f":"Parameter!$F$1","v":"KS"},{"$f":"Parameter!$G$1","v":"LM"},{"$f":"Parameter!$H$1","v":"EN"},"Max",null,null,{"$f":"Parameter!$C$1","v":"MA"},{"$f":"Parameter!$D$1","v":"MN"},{"$f":"Parameter!$E$1","v":"AH"},{"$f":"Parameter!$F$1","v":"KS"},{"$f":"Parameter!$G$1","v":"LM"},{"$f":"Parameter!$H$1","v":"EN"},"Max",null,null,{"$f":"Parameter!$C$1","v":"MA"},{"$f":"Parameter!$D$1","v":"MN"},{"$f":"Parameter!$E$1","v":"AH"},{"$f":"Parameter!$F$1","v":"KS"},{"$f":"Parameter!$G$1","v":"LM"},{"$f":"Parameter!$H$1","v":"EN"},null,{"$f":"Parameter!$C$1","v":"MA"},{"$f":"Parameter!$D$1","v":"MN"},{"$f":"Parameter!$E$1","v":"AH"},{"$f":"Parameter!$F$1","v":"KS"},{"$f":"Parameter!$G$1","v":"LM"},{"$f":"Parameter!$H$1","v":"EN"},null,{"$f":"Parameter!$C$1","v":"MA"},{"$f":"Parameter!$D$1","v":"MN"},{"$f":"Parameter!$E$1","v":"AH"},{"$f":"Parameter!$F$1","v":"KS"},{"$f":"Parameter!$G$1","v":"LM"},{"$f":"Parameter!$H$1","v":"EN"},null,"Rang",{"$f":"IF(C26>0,RANK(C43,$C$43:$H$43),\"\")","v":""},"","","","",""]
[null,18,0,0,0,0,0,0,{"$f":"MAX(C26:H26)","v":0},null,null,{"$f":"IF($I26=0,0,ROUND(SUM(C$26:C26),1))","v":0},{"$f":"IF($I26=0,0,ROUND(SUM(D$26:D26),1))","v":0},{"$f":"IF($I26=0,0,ROUND(SUM(E$26:E26),1))","v":0},{"$f":"IF($I26=0,0,ROUND(SUM(F$26:F26),1))","v":0},{"$f":"IF($I26=0,0,ROUND(SUM(G$26:G26),1))","v":0},{"$f":"IF($I26=0,0,ROUND(SUM(H$26:H26),1))","v":0},{"$f":"MAX(L26:Q26)","v":0},null,null,{"$f":"IF($I26>0,RANK(C26,$C26:$H26),\"\")","v":""},{"$f":"IF($I26>0,RANK(D26,$C26:$H26),\"\")","v":""},{"$f":"IF($I26>0,RANK(E26,$C26:$H26),\"\")","v":""},{"$f":"IF($I26>0,RANK(F26,$C26:$H26),\"\")","v":""},{"$f":"IF($I26>0,RANK(G26,$C26:$H26),\"\")","v":""},{"$f":"IF($I26>0,RANK(H26,$C26:$H26),\"\")","v":""},null,{"$f":"IF($R26>0,RANK(L26,$L26:$Q26),\"\")","v":""},{"$f":"IF($R26>0,RANK(M26,$L26:$Q26),\"\")","v":""},{"$f":"IF($R26>0,RANK(N26,$L26:$Q26),\"\")","v":""},{"$f":"IF($R26>0,RANK(O26,$L26:$Q26),\"\")","v":""},{"$f":"IF($R26>0,RANK(P26,$L26:$Q26),\"\")","v":""},{"$f":"IF($R26>0,RANK(Q26,$L26:$Q26),\"\")","v":""},null,{"$f":"L26-$R26","v":0},{"$f":"M26-$R26","v":0},{"$f":"N26-$R26","v":0},{"$f":"O26-$R26","v":0},{"$f":"P26-$R26","v":0},{"$f":"Q26-$R26","v":0},null,"Einsatz €",{"$f":"Parameter!C3","v":25},{"$f":"Parameter!D3","v":25},{"$f":"Parameter!E3","v":25},{"$f":"Parameter!F3","v":25},{"$f":"Parameter!G3","v":0},{"$f":"Parameter!H3","v":0}]
[null,19,0,0,0,0,0,0,{"$f":"MAX(C27:H27)","v":0},null,null,{"$f":"IF($I27=0,0,ROUND(SUM(C$26:C27),1))","v":0},{"$f":"IF($I27=0,0,ROUND(SUM(D$26:D27),1))","v":0},{"$f":"IF($I27=0,0,ROUND(SUM(E$26:E27),1))","v":0},{"$f":"IF($I27=0,0,ROUND(SUM(F$26:F27),1))","v":0},{"$f":"IF($I27=0,0,ROUND(SUM(G$26:G27),1))","v":0},{"$f":"IF($I27=0,0,ROUND(SUM(H$26:H27),1))","v":0},{"$f":"MAX(L27:Q27)","v":0},null,null,{"$f":"IF($I27>0,RANK(C27,$C27:$H27),\"\")","v":""},"","","","","",null,{"$f":"IF($R27>0,RANK(L27,$L27:$Q27),\"\")","v":""},"","","","","",null,{"$f":"L27-$R27","v":0},0,0,0,0,0,null,"Anteil €",{"$f":"IF(C26>0,SUM($AQ26:$AV26)*INDEX(Parameter!$B$8:$B$13,Übersicht!AQ25,1),AQ26)","v":25},{"$f":"IF(D26>0,SUM($AQ26:$AV26)*INDEX(Parameter!$B$8:$B$13,Übersicht!AR25,1),AR26)","v":25},{"$f":"IF(E26>0,SUM($AQ26:$AV26)*INDEX(Parameter!$B$8:$B$13,Übersicht!AS25,1),AS26)","v":25},{"$f":"IF(F26>0,SUM($AQ26:$AV26)*INDEX(Parameter!$B$8:$B$13,Übersicht!AT25,1),AT26)","v":25},{"$f":"IF(G26>0,SUM($AQ26:$AV26)*INDEX(Parameter!$B$8:$B$13,Übersicht!AU25,1),AU26)","v":0},{"$f":"IF(H26>0,SUM($AQ26:$AV26)*INDEX(Parameter!$B$8:$B$13,Übersicht!AV25,1),AV26)","v":0}]
[null,20,0,0,0,0,0,0,0,null,null,{"$f":"IF($I28=0,0,ROUND(SUM(C$26:C28),1))","v":0},{"$f":"IF($I28=0,0,ROUND(SUM(D$26:D28),1))","v":0},{"$f":"IF($I28=0,0,ROUND(SUM(E$26:E28),1))","v":0},{"$f":"IF($I28=0,0,ROUND(SUM(F$26:F28),1))","v":0},{"$f":"IF($I28=0,0,ROUND(SUM(G$26:G28),1))","v":0},{"$f":"IF($I28=0,0,ROUND(SUM(H$26:H28),1))","v":0},0,null,null,"","","","","","",null,"","","","","","",null,0,0,0,0,0,0,null,"Gewinn €",{"$f":"AQ27-AQ26","v":0},0,0,0,0,0]
[null,21,0,0,0,0,0,0,0,null,null,{"$f":"IF($I29=0,0,ROUND(SUM(C$26:C29),1))","v":0},{"$f":"IF($I29=0,0,ROUND(SUM(D$26:D29),1))","v":0},{"$f":"IF($I29=0,0,ROUND(SUM(E$26:E29),1))","v":0},{"$f":"IF($I29=0,0,ROUND(SUM(F$26:F29),1))","v":0},{"$f":"IF($I29=0,0,ROUND(SUM(G$26:G29),1))","v":0},{"$f":"IF($I29=0,0,ROUND(SUM(H$26:H29),1))","v":0},0,null,null,"","","","","","",null,"","","","","","",null,0,0,0,0,0,0,null,"Siege",{"$f":"SUMIF(U26:U42,\"=1\",U26:U42)","v":0},0,0,0,0,0]
[null,22,0,0,0,0,0,0,0,null,null,{"$f":"IF($I30=0,0,ROUND(SUM(C$26:C30),1))","v":0},{"$f":"IF($I30=0,0,ROUND(SUM(D$26:D30),1))","v":0},{"$f":"IF($I30=0,0,ROUND(SUM(E$26:E30),1))","v":0},{"$f":"IF($I30=0,0,ROUND(SUM(F$26:F30),1))","v":0},{"$f":"IF($I30=0,0,ROUND(SUM(G$26:G30),1))","v":0},{"$f":"IF($I30=0,0,ROUND(SUM(H$26:H30),1))","v":0},0,null,null,"","","","","","",null,"","","","","","",null,0,0,0,0,0,0,null,"Seidl",{"$f":"Seidl!J20","v":0},{"$f":"Seidl!K20","v":0},{"$f":"Seidl!L20","v":0},{"$f":"Seidl!M20","v":0},{"$f":"Seidl!N20","v":0},{"$f":"Seidl!O20","v":0}]
[null,23,0,0,0,0,0,0,0,null,null,{"$f":"IF($I31=0,0,ROUND(SUM(C$26:C31),1))","v":0},{"$f":"IF($I31=0,0,ROUND(SUM(D$26:D31),1))","v":0},{"$f":"IF($I31=0,0,ROUND(SUM(E$26:E31),1))","v":0},{"$f":"IF($I31=0,0,ROUND(SUM(F$26:F31),1))","v":0},{"$f":"IF($I31=0,0,ROUND(SUM(G$26:G31),1))","v":0},{"$f":"IF($I31=0,0,ROUND(SUM(H$26:H31),1))","v":0},0,null,null,"","","","","","",null,"","","","","","",null,0,0,0,0,0,0,null,"Seidl €",{"$f":"AQ30*Parameter!$B$17","v":0},{"$f":"AR30*Parameter!$B$17","v":0},{"$f":"AS30*Parameter!$B$17","v":0},{"$f":"AT30*Parameter!$B$17","v":0},{"$f":"AU30*Parameter!$B$17","v":0},{"$f":"AV30*Parameter!$B$17","v":0}]
[null,24,0,0,0,0,0,0,0,null,null,{"$f":"IF($I32=0,0,ROUND(SUM(C$26:C32),1))","v":0},{"$f":"IF($I32=0,0,ROUND(SUM(D$26:D32),1))","v":0},{"$f":"IF($I32=0,0,ROUND(SUM(E$26:E32),1))","v":0},{"$f":"IF($I32=0,0,ROUND(SUM(F$26:F32),1))","v":0},{"$f":"IF($I32=0,0,ROUND(SUM(G$26:G32),1))","v":0},{"$f":"IF($I32=0,0,ROUND(SUM(H$26:H32),1))","v":0},0,null,null,"","","","","","",null,"","","","","","",null,0,0,0,0,0,0,null,null,{"$f":"RANK(AQ31,$AQ31:$AT31)","v":1},{"$f":"RANK(AR31,$AQ31:$AT31)","v":1},{"$f":"RANK(AS31,$AQ31:$AT31)","v":1},{"$f":"RANK(AT31,$AQ31:$AT31)","v":1},0,0]
[null,25,0,0,0,0,0,0,0,null,null,{"$f":"IF($I33=0,0,ROUND(SUM(C$26:C33),1))","v":0},{"$f":"IF($I33=0,0,ROUND(SUM(D$26:D33),1))","v":0},{"$f":"IF($I33=0,0,ROUND(SUM(E$26:E33),1))","v":0},{"$f":"IF($I33=0,0,ROUND(SUM(F$26:F33),1))","v":0},{"$f":"IF($I33=0,0,ROUND(SUM(G$26:G33),1))","v":0},{"$f":"IF($I33=0,0,ROUND(SUM(H$26:H33),1))","v":0},0,null,null,"","","","","","",null,"","","","","","",null,0,0,0,0,0,0,null,"Frühjahr €",{"$f":"AQ28+AQ31","v":0},0,0,0,0,0]
[null,26,0,0,0,0,0,0,0,null,null,{"$f":"IF($I34=0,0,ROUND(SUM(C$26:C34),1))","v":0},{"$f":"IF($I34=0,0,ROUND(SUM(D$26:D34),1))","v":0},{"$f":"IF($I34=0,0,ROUND(SUM(E$26:E34),1))","v":0},{"$f":"IF($I34=0,0,ROUND(SUM(F$26:F34),1))","v":0},{"$f":"IF($I34=0,0,ROUND(SUM(G$26:G34),1))","v":0},{"$f":"IF($I34=0,0,ROUND(SUM(H$26:H34),1))","v":0},0,null,null,"","","","","","",null,"","","","","","",null,0,0,0,0,0,0,null,null,{"$f":"IF(AQ26>0,RANK(AQ33,$AQ33:$AT33),0)","v":1},1,1,1,0,0]
[null,27,0,0,0,0,0,0,0,null,null,{"$f":"IF($I35=0,0,ROUND(SUM(C$26:C35),1))","v":0},{"$f":"IF($I35=0,0,ROUND(SUM(D$26:D35),1))","v":0},{"$f":"IF($I35=0,0,ROUND(SUM(E$26:E35),1))","v":0},{"$f":"IF($I35=0,0,ROUND(SUM(F$26:F35),1))","v":0},{"$f":"IF($I35=0,0,ROUND(SUM(G$26:G35),1))","v":0},{"$f":"IF($I35=0,0,ROUND(SUM(H$26:H35),1))","v":0},0,null,null,"","","","","","",null,"","","","","","",null,0,0,0,0,0,0,null,"H+F",{"$f":"AQ33+AQ11","v":0},{"$f":"AR33+AR11","v":0},0,0]
[null,28,0,0,0,0,0,0,0,null,null,{"$f":"IF($I36=0,0,ROUND(SUM(C$26:C36),1))","v":0},{"$f":"IF($I36=0,0,ROUND(SUM(D$26:D36),1))","v":0},{"$f":"IF($I36=0,0,ROUND(SUM(E$26:E36),1))","v":0},{"$f":"IF($I36=0,0,ROUND(SUM(F$26:F36),1))","v":0},{"$f":"IF($I36=0,0,ROUND(SUM(G$26:G36),1))","v":0},{"$f":"IF($I36=0,0,ROUND(SUM(H$26:H36),1))","v":0},0,null,null,"","","","","","",null,"","","","","","",null,0,0,0,0,0,0]
[null,29,0,0,0,0,0,0,0,null,null,{"$f":"IF($I37=0,0,ROUND(SUM(C$26:C37),1))","v":0},{"$f":"IF($I37=0,0,ROUND(SUM(D$26:D37),1))","v":0},{"$f":"IF($I37=0,0,ROUND(SUM(E$26:E37),1))","v":0},{"$f":"IF($I37=0,0,ROUND(SUM(F$26:F37),1))","v":0},{"$f":"IF($I37=0,0,ROUND(SUM(G$26:G37),1))","v":0},{"$f":"IF($I37=0,0,ROUND(SUM(H$26:H37),1))","v":0},0,null,null,"","","","","","",null,"","","","","","",null,0,0,0,0,0,0,null,null,"Maximale Punkte"]
[null,30,0,0,0,0,0,0,0,null,null,{"$f":"IF($I38=0,0,ROUND(SUM(C$26:C38),1))","v":0},{"$f":"IF($I38=0,0,ROUND(SUM(D$26:D38),1))","v":0},{"$f":"IF($I38=0,0,ROUND(SUM(E$26:E38),1))","v":0},{"$f":"IF($I38=0,0,ROUND(SUM(F$26:F38),1))","v":0},{"$f":"IF($I38=0,0,ROUND(SUM(G$26:G38),1))","v":0},{"$f":"IF($I38=0,0,ROUND(SUM(H$26:H38),1))","v":0},0,null,null,"","","","","","",null,"","","","","","",null,0,0,0,0,0,0,null,null,{"$f":"Parameter!$C$1","v":"MA"},{"$f":"Parameter!$D$1","v":"MN"},{"$f":"Parameter!$E$1","v":"AH"},{"$f":"Parameter!$F$1","v":"KS"},{"$f":"Parameter!$G$1","v":"LM"},{"$f":"Parameter!$H$1","v":"EN"}]
[null,31,0,0,0,0,0,0,0,null,null,{"$f":"IF($I39=0,0,ROUND(SUM(C$26:C39),1))","v":0},{"$f":"IF($I39=0,0,ROUND(SUM(D$26:D39),1))","v":0},{"$f":"IF($I39=0,0,ROUND(SUM(E$26:E39),1))","v":0},{"$f":"IF($I39=0,0,ROUND(SUM(F$26:F39),1))","v":0},{"$f":"IF($I39=0,0,ROUND(SUM(G$26:G39),1))","v":0},{"$f":"IF($I39=0,0,ROUND(SUM(H$26:H39),1))","v":0},0,null,null,"","","","","","",null,"","","","","","",null,0,0,0,0,0,0,null,null,{"$f":"MAX(C26:C42)","v":0},0,0,0,0,0]
[null,32,0,0,0,0,0,0,0,null,null,{"$f":"IF($I40=0,0,ROUND(SUM(C$26:C40),1))","v":0},{"$f":"IF($I40=0,0,ROUND(SUM(D$26:D40),1))","v":0},{"$f":"IF($I40=0,0,ROUND(SUM(E$26:E40),1))","v":0},{"$f":"IF($I40=0,0,ROUND(SUM(F$26:F40),1))","v":0},{"$f":"IF($I40=0,0,ROUND(SUM(G$26:G40),1))","v":0},{"$f":"IF($I40=0,0,ROUND(SUM(H$26:H40),1))","v":0},0,null,null,"","","","","","",null,"","","","","","",null,0,0,0,0,0,0,null,null,"Minimale Punkte"]
[null,33,0,0,0,0,0,0,0,null,null,{"$f":"IF($I41=0,0,ROUND(SUM(C$26:C41),1))","v":0},{"$f":"IF($I41=0,0,ROUND(SUM(D$26:D41),1))","v":0},{"$f":"IF($I41=0,0,ROUND(SUM(E$26:E41),1))","v":0},{"$f":"IF($I41=0,0,ROUND(SUM(F$26:F41),1))","v":0},{"$f":"IF($I41=0,0,ROUND(SUM(G$26:G41),1))","v":0},{"$f":"IF($I41=0,0,ROUND(SUM(H$26:H41),1))","v":0},0,null,null,"","","","","","",null,"","","","","","",null,0,0,0,0,0,0,null,null,{"$f":"Parameter!$C$1","v":"MA"},{"$f":"Parameter!$D$1","v":"MN"},{"$f":"Parameter!$E$1","v":"AH"},{"$f":"Parameter!$F$1","v":"KS"},{"$f":"Parameter!$G$1","v":"LM"},{"$f":"Parameter!$H$1","v":"EN"}]
[null,34,0,0,0,0,0,0,0,null,null,{"$f":"IF($I42=0,0,ROUND(SUM(C$26:C42),1))","v":0},{"$f":"IF($I42=0,0,ROUND(SUM(D$26:D42),1))","v":0},{"$f":"IF($I42=0,0,ROUND(SUM(E$26:E42),1))","v":0},{"$f":"IF($I42=0,0,ROUND(SUM(F$26:F42),1))","v":0},{"$f":"IF($I42=0,0,ROUND(SUM(G$26:G42),1))","v":0},{"$f":"IF($I42=0,0,ROUND(SUM(H$26:H42),1))","v":0},0,null,null,"","","","","","",null,"","","","","","",null,0,0,0,0,0,0,null,null,0,0,0,0,0,0]
[null,"Frühjahr",{"$f":"ROUND(SUM(C26:C42),1)","v":0},0,0,0,0,0,{"$f":"MAX(C43:H43)","v":0},null,null,null,null,null,null,null,null,null,null,null,{"$f":"SUM(U26:U42)/COUNT(U26:U42)","v":{"$error":"#DIV/0!"}},{"$error":"#DIV/0!"},{"$error":"#DIV/0!"},{"$error":"#DIV/0!"},{"$error":"#DIV/0!"},{"$error":"#DIV/0!"}]
[]
[]
[null,{"$f":"Parameter!B15","v":"26/27"},"Punkte einzeln",null,null,null,null,null,null,null,null,"Punkte kumulativ",null,null,null,null,null,null,null,null,"Rang einzeln",null,null,null,null,null,null,"Rang kumulativ",null,null,null,null,null,null,"Differenz zum Ersten",null,null,null,null,null,null,{"$f":"Parameter!B15","v":"26/27"},{"$f":"Parameter!$C$1","v":"MA"},{"$f":"Parameter!$D$1","v":"MN"},{"$f":"Parameter!$E$1","v":"AH"},{"$f":"Parameter!$F$1","v":"KS"},{"$f":"Parameter!$G$1","v":"LM"},{"$f":"Parameter!$H$1","v":"EN"}]
[null,null,{"$f":"Parameter!$C$1","v":"MA"},{"$f":"Parameter!$D$1","v":"MN"},{"$f":"Parameter!$E$1","v":"AH"},{"$f":"Parameter!$F$1","v":"KS"},{"$f":"Parameter!$G$1","v":"LM"},{"$f":"Parameter!$H$1","v":"EN"},"Max",null,null,{"$f":"Parameter!$C$1","v":"MA"},{"$f":"Parameter!$D$1","v":"MN"},{"$f":"Parameter!$E$1","v":"AH"},{"$f":"Parameter!$F$1","v":"KS"},{"$f":"Parameter!$G$1","v":"LM"},{"$f":"Parameter!$H$1","v":"EN"},"Max",null,null,{"$f":"Parameter!$C$1","v":"MA"},{"$f":"Parameter!$D$1","v":"MN"},{"$f":"Parameter!$E$1","v":"AH"},{"$f":"Parameter!$F$1","v":"KS"},{"$f":"Parameter!$G$1","v":"LM"},{"$f":"Parameter!$H$1","v":"EN"},null,{"$f":"Parameter!$C$1","v":"MA"},{"$f":"Parameter!$D$1","v":"MN"},{"$f":"Parameter!$E$1","v":"AH"},{"$f":"Parameter!$F$1","v":"KS"},{"$f":"Parameter!$G$1","v":"LM"},{"$f":"Parameter!$H$1","v":"EN"},null,{"$f":"Parameter!$C$1","v":"MA"},{"$f":"Parameter!$D$1","v":"MN"},{"$f":"Parameter!$E$1","v":"AH"},{"$f":"Parameter!$F$1","v":"KS"},{"$f":"Parameter!$G$1","v":"LM"},{"$f":"Parameter!$H$1","v":"EN"},null,"Rang",{"$f":"IF(C48>0,RANK(C82,$C$82:$H$82),\"\")","v":""},"","","","",""]
[null,1,{"$f":"C4","v":0},0,0,0,0,0,{"$f":"MAX(C48:H48)","v":0},null,null,{"$f":"IF($I48=0,0,ROUND(SUM(C$48:C48),1))","v":0},{"$f":"IF($I48=0,0,ROUND(SUM(D$48:D48),1))","v":0},{"$f":"IF($I48=0,0,ROUND(SUM(E$48:E48),1))","v":0},{"$f":"IF($I48=0,0,ROUND(SUM(F$48:F48),1))","v":0},{"$f":"IF($I48=0,0,ROUND(SUM(G$48:G48),1))","v":0},{"$f":"IF($I48=0,0,ROUND(SUM(H$48:H48),1))","v":0},{"$f":"MAX(L48:Q48)","v":0},null,null,{"$f":"U4","v":""},{"$f":"IF($I48>0,RANK(D48,$C48:$H48),\"\")","v":""},{"$f":"IF($I48>0,RANK(E48,$C48:$H48),\"\")","v":""},{"$f":"IF($I48>0,RANK(F48,$C48:$H48),\"\")","v":""},{"$f":"IF($I48>0,RANK(G48,$C48:$H48),\"\")","v":""},{"$f":"IF($I48>0,RANK(H48,$C48:$H48),\"\")","v":""},null,{"$f":"AB4","v":""},{"$f":"IF($R48>0,RANK(M48,$L48:$Q48),\"\")","v":""},{"$f":"IF($R48>0,RANK(N48,$L48:$Q48),\"\")","v":""},{"$f":"IF($R48>0,RANK(O48,$L48:$Q48),\"\")","v":""},{"$f":"IF($R48>0,RANK(P48,$L48:$Q48),\"\")","v":""},{"$f":"IF($R48>0,RANK(Q48,$L48:$Q48),\"\")","v":""},null,{"$f":"L48-MAX($L48:$Q48)","v":0},{"$f":"M48-MAX($L48:$Q48)","v":0},{"$f":"N48-MAX($L48:$Q48)","v":0},{"$f":"O48-MAX($L48:$Q48)","v":0},{"$f":"P48-MAX($L48:$Q48)","v":0},{"$f":"Q48-MAX($L48:$Q48)","v":0},null,"Einsatz €",{"$f":"Parameter!C4","v":0},{"$f":"Parameter!D4","v":0},{"$f":"Parameter!E4","v":0},{"$f":"Parameter!F4","v":0},{"$f":"Parameter!G4","v":0},{"$f":"Parameter!H4","v":0}]
[null,2,{"$f":"C5","v":0},0,0,0,0,0,{"$f":"MAX(C49:H49)","v":0},null,null,{"$f":"IF($I49=0,0,ROUND(SUM(C$48:C49),1))","v":0},{"$f":"IF($I49=0,0,ROUND(SUM(D$48:D49),1))","v":0},{"$f":"IF($I49=0,0,ROUND(SUM(E$48:E49),1))","v":0},{"$f":"IF($I49=0,0,ROUND(SUM(F$48:F49),1))","v":0},{"$f":"IF($I49=0,0,ROUND(SUM(G$48:G49),1))","v":0},{"$f":"IF($I49=0,0,ROUND(SUM(H$48:H49),1))","v":0},{"$f":"MAX(L49:Q49)","v":0},null,null,{"$f":"IF($I49>0,RANK(C49,$C49:$H49),\"\")","v":""},{"$f":"IF($I49>0,RANK(D49,$C49:$H49),\"\")","v":""},{"$f":"IF($I49>0,RANK(E49,$C49:$H49),\"\")","v":""},{"$f":"IF($I49>0,RANK(F49,$C49:$H49),\"\")","v":""},{"$f":"IF($I49>0,RANK(G49,$C49:$H49),\"\")","v":""},{"$f":"IF($I49>0,RANK(H49,$C49:$H49),\"\")","v":""},null,{"$f":"IF($R49>0,RANK(L49,$L49:$Q49),\"\")","v":""},{"$f":"IF($R49>0,RANK(M49,$L49:$Q49),\"\")","v":""},{"$f":"IF($R49>0,RANK(N49,$L49:$Q49),\"\")","v":""},{"$f":"IF($R49>0,RANK(O49,$L49:$Q49),\"\")","v":""},{"$f":"IF($R49>0,RANK(P49,$L49:$Q49),\"\")","v":""},{"$f":"IF($R49>0,RANK(Q49,$L49:$Q49),\"\")","v":""},null,0,0,0,0,0,0,null,"Anteil €",{"$f":"IF(C48>0,SUM($AQ48:$AV48)*INDEX(Parameter!$B$8:$B$13,Übersicht!AQ47,1),AQ48)","v":0},{"$f":"IF(D48>0,SUM($AQ48:$AV48)*INDEX(Parameter!$B$8:$B$13,Übersicht!AR47,1),AR48)","v":0},{"$f":"IF(E48>0,SUM($AQ48:$AV48)*INDEX(Parameter!$B$8:$B$13,Übersicht!AS47,1),AS48)","v":0},{"$f":"IF(F48>0,SUM($AQ48:$AV48)*INDEX(Parameter!$B$8:$B$13,Übersicht!AT47,1),AT48)","v":0},{"$f":"IF(G48>0,SUM($AQ48:$AV48)*INDEX(Parameter!$B$8:$B$13,Übersicht!AU47,1),AU48)","v":0},{"$f":"IF(H48>0,SUM($AQ48:$AV48)*INDEX(Parameter!$B$8:$B$13,Übersicht!AV47,1),AV48)","v":0}]
[null,3,{"$f":"C6","v":0},0,0,0,0,0,0,null,null,{"$f":"IF($I50=0,0,ROUND(SUM(C$48:C50),1))","v":0},{"$f":"IF($I50=0,0,ROUND(SUM(D$48:D50),1))","v":0},{"$f":"IF($I50=0,0,ROUND(SUM(E$48:E50),1))","v":0},{"$f":"IF($I50=0,0,ROUND(SUM(F$48:F50),1))","v":0},{"$f":"IF($I50=0,0,ROUND(SUM(G$48:G50),1))","v":0},{"$f":"IF($I50=0,0,ROUND(SUM(H$48:H50),1))","v":0},0,null,null,"","","","","","",null,"","","","","","",null,0,0,0,0,0,0,null,"Gewinn €",{"$f":"AQ49-AQ48","v":0},0,0,0,0,0]
[null,4,{"$f":"C7","v":0},0,0,0,0,0,0,null,null,{"$f":"IF($I51=0,0,ROUND(SUM(C$48:C51),1))","v":0},{"$f":"IF($I51=0,0,ROUND(SUM(D$48:D51),1))","v":0},{"$f":"IF($I51=0,0,ROUND(SUM(E$48:E51),1))","v":0},{"$f":"IF($I51=0,0,ROUND(SUM(F$48:F51),1))","v":0},{"$f":"IF($I51=0,0,ROUND(SUM(G$48:G51),1))","v":0},{"$f":"IF($I51=0,0,ROUND(SUM(H$48:H51),1))","v":0},0,null,null,"","","","","","",null,"","","","","","",null,0,0,0,0,0,0]
[null,5,{"$f":"C8","v":0},0,0,0,0,0,0,null,null,{"$f":"IF($I52=0,0,ROUND(SUM(C$48:C52),1))","v":0},{"$f":"IF($I52=0,0,ROUND(SUM(D$48:D52),1))","v":0},{"$f":"IF($I52=0,0,ROUND(SUM(E$48:E52),1))","v":0},{"$f":"IF($I52=0,0,ROUND(SUM(F$48:F52),1))","v":0},{"$f":"IF($I52=0,0,ROUND(SUM(G$48:G52),1))","v":0},{"$f":"IF($I52=0,0,ROUND(SUM(H$48:H52),1))","v":0},0,null,null,"","","","","","",null,"","","","","","",null,0,0,0,0,0,0,null,"Herbst  €",{"$f":"AQ11","v":0},0,0,0,0,0]
[null,6,{"$f":"C9","v":0},0,0,0,0,0,0,null,null,{"$f":"IF($I53=0,0,ROUND(SUM(C$48:C53),1))","v":0},{"$f":"IF($I53=0,0,ROUND(SUM(D$48:D53),1))","v":0},{"$f":"IF($I53=0,0,ROUND(SUM(E$48:E53),1))","v":0},{"$f":"IF($I53=0,0,ROUND(SUM(F$48:F53),1))","v":0},{"$f":"IF($I53=0,0,ROUND(SUM(G$48:G53),1))","v":0},{"$f":"IF($I53=0,0,ROUND(SUM(H$48:H53),1))","v":0},0,null,null,"","","","","","",null,"","","","","","",null,0,0,0,0,0,0,null,"Frühjahr €",{"$f":"AQ33","v":0},0,0,0,0,0]
[null,7,{"$f":"C10","v":0},0,0,0,0,0,0,null,null,{"$f":"IF($I54=0,0,ROUND(SUM(C$48:C54),1))","v":0},{"$f":"IF($I54=0,0,ROUND(SUM(D$48:D54),1))","v":0},{"$f":"IF($I54=0,0,ROUND(SUM(E$48:E54),1))","v":0},{"$f":"IF($I54=0,0,ROUND(SUM(F$48:F54),1))","v":0},{"$f":"IF($I54=0,0,ROUND(SUM(G$48:G54),1))","v":0},{"$f":"IF($I54=0,0,ROUND(SUM(H$48:H54),1))","v":0},0,null,null,"","","","","","",null,"","","","","","",null,0,0,0,0,0,0,null,"Jahr €",{"$f":"AQ50","v":0},0,0,0,0,0]
[null,8,{"$f":"C11","v":0},0,0,0,0,0,0,null,null,{"$f":"IF($I55=0,0,ROUND(SUM(C$48:C55),1))","v":0},{"$f":"IF($I55=0,0,ROUND(SUM(D$48:D55),1))","v":0},{"$f":"IF($I55=0,0,ROUND(SUM(E$48:E55),1))","v":0},{"$f":"IF($I55=0,0,ROUND(SUM(F$48:F55),1))","v":0},{"$f":"IF($I55=0,0,ROUND(SUM(G$48:G55),1))","v":0},{"$f":"IF($I55=0,0,ROUND(SUM(H$48:H55),1))","v":0},0,null,null,"","","","","","",null,"","","","","","",null,0,0,0,0,0,0,null,{"$f":"Parameter!B15&\" €\"","v":"26/27 €"},{"$f":"SUM(AQ52:AQ54)","v":0},0,0,0,0,0]
[null,9,{"$f":"C12","v":0},0,0,0,0,0,0,null,null,{"$f":"IF($I56=0,0,ROUND(SUM(C$48:C56),1))","v":0},{"$f":"IF($I56=0,0,ROUND(SUM(D$48:D56),1))","v":0},{"$f":"IF($I56=0,0,ROUND(SUM(E$48:E56),1))","v":0},{"$f":"IF($I56=0,0,ROUND(SUM(F$48:F56),1))","v":0},{"$f":"IF($I56=0,0,ROUND(SUM(G$48:G56),1))","v":0},{"$f":"IF($I56=0,0,ROUND(SUM(H$48:H56),1))","v":0},0,null,null,"","","","","","",null,"","","","","","",null,0,0,0,0,0,0]
[null,10,{"$f":"C13","v":0},0,0,0,0,0,0,null,null,{"$f":"IF($I57=0,0,ROUND(SUM(C$48:C57),1))","v":0},{"$f":"IF($I57=0,0,ROUND(SUM(D$48:D57),1))","v":0},{"$f":"IF($I57=0,0,ROUND(SUM(E$48:E57),1))","v":0},{"$f":"IF($I57=0,0,ROUND(SUM(F$48:F57),1))","v":0},{"$f":"IF($I57=0,0,ROUND(SUM(G$48:G57),1))","v":0},{"$f":"IF($I57=0,0,ROUND(SUM(H$48:H57),1))","v":0},0,null,null,"","","","","","",null,"","","","","","",null,0,0,0,0,0,0]
[null,11,{"$f":"C14","v":0},0,0,0,0,0,0,null,null,{"$f":"IF($I58=0,0,ROUND(SUM(C$48:C58),1))","v":0},{"$f":"IF($I58=0,0,ROUND(SUM(D$48:D58),1))","v":0},{"$f":"IF($I58=0,0,ROUND(SUM(E$48:E58),1))","v":0},{"$f":"IF($I58=0,0,ROUND(SUM(F$48:F58),1))","v":0},{"$f":"IF($I58=0,0,ROUND(SUM(G$48:G58),1))","v":0},{"$f":"IF($I58=0,0,ROUND(SUM(H$48:H58),1))","v":0},0,null,null,"","","","","","",null,"","","","","","",null,0,0,0,0,0,0,null,null,"Maximale Punkte"]
[null,12,{"$f":"C15","v":0},0,0,0,0,0,0,null,null,{"$f":"IF($I59=0,0,ROUND(SUM(C$48:C59),1))","v":0},{"$f":"IF($I59=0,0,ROUND(SUM(D$48:D59),1))","v":0},{"$f":"IF($I59=0,0,ROUND(SUM(E$48:E59),1))","v":0},{"$f":"IF($I59=0,0,ROUND(SUM(F$48:F59),1))","v":0},{"$f":"IF($I59=0,0,ROUND(SUM(G$48:G59),1))","v":0},{"$f":"IF($I59=0,0,ROUND(SUM(H$48:H59),1))","v":0},0,null,null,"","","","","","",null,"","","","","","",null,0,0,0,0,0,0,null,null,{"$f":"Parameter!$C$1","v":"MA"},{"$f":"Parameter!$D$1","v":"MN"},{"$f":"Parameter!$E$1","v":"AH"},{"$f":"Parameter!$F$1","v":"KS"},{"$f":"Parameter!$G$1","v":"LM"},{"$f":"Parameter!$H$1","v":"EN"}]
[null,13,{"$f":"C16","v":0},0,0,0,0,0,0,null,null,{"$f":"IF($I60=0,0,ROUND(SUM(C$48:C60),1))","v":0},{"$f":"IF($I60=0,0,ROUND(SUM(D$48:D60),1))","v":0},{"$f":"IF($I60=0,0,ROUND(SUM(E$48:E60),1))","v":0},{"$f":"IF($I60=0,0,ROUND(SUM(F$48:F60),1))","v":0},{"$f":"IF($I60=0,0,ROUND(SUM(G$48:G60),1))","v":0},{"$f":"IF($I60=0,0,ROUND(SUM(H$48:H60),1))","v":0},0,null,null,"","","","","","",null,"","","","","","",null,0,0,0,0,0,0,null,null,{"$f":"MAX(C48:C81)","v":0},0,0,0,0,0]
[null,14,{"$f":"C17","v":0},0,{"$f":"E17","v":0},0,0,0,0,null,null,{"$f":"IF($I61=0,0,ROUND(SUM(C$48:C61),1))","v":0},{"$f":"IF($I61=0,0,ROUND(SUM(D$48:D61),1))","v":0},{"$f":"IF($I61=0,0,ROUND(SUM(E$48:E61),1))","v":0},{"$f":"IF($I61=0,0,ROUND(SUM(F$48:F61),1))","v":0},{"$f":"IF($I61=0,0,ROUND(SUM(G$48:G61),1))","v":0},{"$f":"IF($I61=0,0,ROUND(SUM(H$48:H61),1))","v":0},0,null,null,"","","","","","",null,"","","","","","",null,0,0,0,0,0,0,null,null,"Minimale Punkte"]
[null,15,{"$f":"C18","v":0},0,{"$f":"E18","v":0},0,0,0,0,null,null,{"$f":"IF($I62=0,0,ROUND(SUM(C$48:C62),1))","v":0},{"$f":"IF($I62=0,0,ROUND(SUM(D$48:D62),1))","v":0},{"$f":"IF($I62=0,0,ROUND(SUM(E$48:E62),1))","v":0},{"$f":"IF($I62=0,0,ROUND(SUM(F$48:F62),1))","v":0},{"$f":"IF($I62=0,0,ROUND(SUM(G$48:G62),1))","v":0},{"$f":"IF($I62=0,0,ROUND(SUM(H$48:H62),1))","v":0},0,null,null,"","","","","","",null,"","","","","","",null,0,0,0,0,0,0,null,null,{"$f":"Parameter!$C$1","v":"MA"},{"$f":"Parameter!$D$1","v":"MN"},{"$f":"Parameter!$E$1","v":"AH"},{"$f":"Parameter!$F$1","v":"KS"},{"$f":"Parameter!$G$1","v":"LM"},{"$f":"Parameter!$H$1","v":"EN"}]
[null,16,{"$f":"C19","v":0},0,0,0,0,0,0,null,null,{"$f":"IF($I63=0,0,ROUND(SUM(C$48:C63),1))","v":0},{"$f":"IF($I63=0,0,ROUND(SUM(D$48:D63),1))","v":0},{"$f":"IF($I63=0,0,ROUND(SUM(E$48:E63),1))","v":0},{"$f":"IF($I63=0,0,ROUND(SUM(F$48:F63),1))","v":0},{"$f":"IF($I63=0,0,ROUND(SUM(G$48:G63),1))","v":0},{"$f":"IF($I63=0,0,ROUND(SUM(H$48:H63),1))","v":0},0,null,null,"","","","","","",null,"","","","","","",null,0,0,0,0,0,0,null,null,0,0,0,0,0,0]
[null,17,{"$f":"C20","v":0},0,0,0,0,0,0,null,null,{"$f":"IF($I64=0,0,ROUND(SUM(C$48:C64),1))","v":0},{"$f":"IF($I64=0,0,ROUND(SUM(D$48:D64),1))","v":0},{"$f":"IF($I64=0,0,ROUND(SUM(E$48:E64),1))","v":0},{"$f":"IF($I64=0,0,ROUND(SUM(F$48:F64),1))","v":0},{"$f":"IF($I64=0,0,ROUND(SUM(G$48:G64),1))","v":0},{"$f":"IF($I64=0,0,ROUND(SUM(H$48:H64),1))","v":0},0,null,null,"","","","","","",null,"","","","","","",null,0,0,0,0,0,0]
[null,18,{"$f":"C26","v":0},0,0,0,0,0,0,null,null,{"$f":"IF($I65=0,0,ROUND(SUM(C$48:C65),1))","v":0},{"$f":"IF($I65=0,0,ROUND(SUM(D$48:D65),1))","v":0},{"$f":"IF($I65=0,0,ROUND(SUM(E$48:E65),1))","v":0},{"$f":"IF($I65=0,0,ROUND(SUM(F$48:F65),1))","v":0},{"$f":"IF($I65=0,0,ROUND(SUM(G$48:G65),1))","v":0},{"$f":"IF($I65=0,0,ROUND(SUM(H$48:H65),1))","v":0},{"$f":"MAX(L65:Q65)","v":0},null,null,"","","","","","",null,"","","","","","",null,{"$f":"L65-MAX($L65:$Q65)","v":0},{"$f":"M65-MAX($L65:$Q65)","v":0},{"$f":"N65-MAX($L65:$Q65)","v":0},{"$f":"O65-MAX($L65:$Q65)","v":0},{"$f":"P65-MAX($L65:$Q65)","v":0},{"$f":"Q65-MAX($L65:$Q65)","v":0},null,null,{"$f":"RANK(AQ52,$AQ52:$AT52)","v":1},1,1,1,0,0]
[null,19,{"$f":"C27","v":0},0,0,0,0,0,0,null,null,{"$f":"IF($I66=0,0,ROUND(SUM(C$48:C66),1))","v":0},{"$f":"IF($I66=0,0,ROUND(SUM(D$48:D66),1))","v":0},{"$f":"IF($I66=0,0,ROUND(SUM(E$48:E66),1))","v":0},{"$f":"IF($I66=0,0,ROUND(SUM(F$48:F66),1))","v":0},{"$f":"IF($I66=0,0,ROUND(SUM(G$48:G66),1))","v":0},{"$f":"IF($I66=0,0,ROUND(SUM(H$48:H66),1))","v":0},0,null,null,"","","","","","",null,"","","","","","",null,0,0,0,0,0,0,null,null,1,1,1,1,{"$f":"RANK(AU53,$AQ53:$AV53)","v":1},1]
[null,20,{"$f":"C28","v":0},0,0,0,0,0,0,null,null,{"$f":"IF($I67=0,0,ROUND(SUM(C$48:C67),1))","v":0},{"$f":"IF($I67=0,0,ROUND(SUM(D$48:D67),1))","v":0},{"$f":"IF($I67=0,0,ROUND(SUM(E$48:E67),1))","v":0},{"$f":"IF($I67=0,0,ROUND(SUM(F$48:F67),1))","v":0},{"$f":"IF($I67=0,0,ROUND(SUM(G$48:G67),1))","v":0},{"$f":"IF($I67=0,0,ROUND(SUM(H$48:H67),1))","v":0},0,null,null,"","","","","","",null,"","","","","","",null,0,0,0,0,0,0,null,null,1,1,1,1,1,1]
[null,21,{"$f":"C29","v":0},0,0,0,0,0,0,null,null,{"$f":"IF($I68=0,0,ROUND(SUM(C$48:C68),1))","v":0},{"$f":"IF($I68=0,0,ROUND(SUM(D$48:D68),1))","v":0},{"$f":"IF($I68=0,0,ROUND(SUM(E$48:E68),1))","v":0},{"$f":"IF($I68=0,0,ROUND(SUM(F$48:F68),1))","v":0},{"$f":"IF($I68=0,0,ROUND(SUM(G$48:G68),1))","v":0},{"$f":"IF($I68=0,0,ROUND(SUM(H$48:H68),1))","v":0},0,null,null,"","","","","","",null,"","","","","","",null,0,0,0,0,0,0,null,null,1,1,1,1,1,1]
[null,22,{"$f":"C30","v":0},0,0,0,0,0,0,null,null,{"$f":"IF($I69=0,0,ROUND(SUM(C$48:C69),1))","v":0},{"$f":"IF($I69=0,0,ROUND(SUM(D$48:D69),1))","v":0},{"$f":"IF($I69=0,0,ROUND(SUM(E$48:E69),1))","v":0},{"$f":"IF($I69=0,0,ROUND(SUM(F$48:F69),1))","v":0},{"$f":"IF($I69=0,0,ROUND(SUM(G$48:G69),1))","v":0},{"$f":"IF($I69=0,0,ROUND(SUM(H$48:H69),1))","v":0},0,null,null,"","","","","","",null,"","","","","","",null,0,0,0,0,0,0]
[null,23,{"$f":"C31","v":0},0,0,0,0,0,0,null,null,{"$f":"IF($I70=0,0,ROUND(SUM(C$48:C70),1))","v":0},{"$f":"IF($I70=0,0,ROUND(SUM(D$48:D70),1))","v":0},{"$f":"IF($I70=0,0,ROUND(SUM(E$48:E70),1))","v":0},{"$f":"IF($I70=0,0,ROUND(SUM(F$48:F70),1))","v":0},{"$f":"IF($I70=0,0,ROUND(SUM(G$48:G70),1))","v":0},{"$f":"IF($I70=0,0,ROUND(SUM(H$48:H70),1))","v":0},0,null,null,"","","","","","",null,"","","","","","",null,0,0,0,0,0,0]
[null,24,{"$f":"C32","v":0},0,0,0,0,0,0,null,null,{"$f":"IF($I71=0,0,ROUND(SUM(C$48:C71),1))","v":0},{"$f":"IF($I71=0,0,ROUND(SUM(D$48:D71),1))","v":0},{"$f":"IF($I71=0,0,ROUND(SUM(E$48:E71),1))","v":0},{"$f":"IF($I71=0,0,ROUND(SUM(F$48:F71),1))","v":0},{"$f":"IF($I71=0,0,ROUND(SUM(G$48:G71),1))","v":0},{"$f":"IF($I71=0,0,ROUND(SUM(H$48:H71),1))","v":0},0,null,null,"","","","","","",null,"","","","","","",null,0,0,0,0,0,0]
[null,25,{"$f":"C33","v":0},0,0,0,0,0,0,null,null,{"$f":"IF($I72=0,0,ROUND(SUM(C$48:C72),1))","v":0},{"$f":"IF($I72=0,0,ROUND(SUM(D$48:D72),1))","v":0},{"$f":"IF($I72=0,0,ROUND(SUM(E$48:E72),1))","v":0},{"$f":"IF($I72=0,0,ROUND(SUM(F$48:F72),1))","v":0},{"$f":"IF($I72=0,0,ROUND(SUM(G$48:G72),1))","v":0},{"$f":"IF($I72=0,0,ROUND(SUM(H$48:H72),1))","v":0},0,null,null,"","","","","","",null,"","","","","","",null,0,0,0,0,0,0,null,"Auszahlg.",{"$f":"Parameter!$C$1","v":"MA"},{"$f":"Parameter!$D$1","v":"MN"},{"$f":"Parameter!$E$1","v":"AH"},{"$f":"Parameter!$F$1","v":"KS"},{"$f":"Parameter!$G$1","v":"LM"},{"$f":"Parameter!$H$1","v":"EN"}]
[null,26,{"$f":"C34","v":0},0,0,0,0,0,0,null,null,{"$f":"IF($I73=0,0,ROUND(SUM(C$48:C73),1))","v":0},{"$f":"IF($I73=0,0,ROUND(SUM(D$48:D73),1))","v":0},{"$f":"IF($I73=0,0,ROUND(SUM(E$48:E73),1))","v":0},{"$f":"IF($I73=0,0,ROUND(SUM(F$48:F73),1))","v":0},{"$f":"IF($I73=0,0,ROUND(SUM(G$48:G73),1))","v":0},{"$f":"IF($I73=0,0,ROUND(SUM(H$48:H73),1))","v":0},0,null,null,"","","","","","",null,"","","","","","",null,0,0,0,0,0,0,null,"Herbst",{"$f":"AQ5","v":25},25,25,25,0,0]
[null,27,{"$f":"C35","v":0},0,0,0,0,0,0,null,null,{"$f":"IF($I74=0,0,ROUND(SUM(C$48:C74),1))","v":0},{"$f":"IF($I74=0,0,ROUND(SUM(D$48:D74),1))","v":0},{"$f":"IF($I74=0,0,ROUND(SUM(E$48:E74),1))","v":0},{"$f":"IF($I74=0,0,ROUND(SUM(F$48:F74),1))","v":0},{"$f":"IF($I74=0,0,ROUND(SUM(G$48:G74),1))","v":0},{"$f":"IF($I74=0,0,ROUND(SUM(H$48:H74),1))","v":0},0,null,null,"","","","","","",null,"","","","","","",null,0,0,0,0,0,0,null,"Frühjahr",{"$f":"AQ27","v":25},25,25,25,0,0]
[null,28,{"$f":"C36","v":0},0,0,0,0,0,0,null,null,{"$f":"IF($I75=0,0,ROUND(SUM(C$48:C75),1))","v":0},{"$f":"IF($I75=0,0,ROUND(SUM(D$48:D75),1))","v":0},{"$f":"IF($I75=0,0,ROUND(SUM(E$48:E75),1))","v":0},{"$f":"IF($I75=0,0,ROUND(SUM(F$48:F75),1))","v":0},{"$f":"IF($I75=0,0,ROUND(SUM(G$48:G75),1))","v":0},{"$f":"IF($I75=0,0,ROUND(SUM(H$48:H75),1))","v":0},0,null,null,"","","","","","",null,"","","","","","",null,0,0,0,0,0,0,null,"Jahr",{"$f":"AQ49","v":0},{"$f":"AR49","v":0},0,0,0,0,0]
[null,29,{"$f":"C37","v":0},0,0,0,0,0,0,null,null,{"$f":"IF($I76=0,0,ROUND(SUM(C$48:C76),1))","v":0},{"$f":"IF($I76=0,0,ROUND(SUM(D$48:D76),1))","v":0},{"$f":"IF($I76=0,0,ROUND(SUM(E$48:E76),1))","v":0},{"$f":"IF($I76=0,0,ROUND(SUM(F$48:F76),1))","v":0},{"$f":"IF($I76=0,0,ROUND(SUM(G$48:G76),1))","v":0},{"$f":"IF($I76=0,0,ROUND(SUM(H$48:H76),1))","v":0},0,null,null,"","","","","","",null,"","","","","","",null,0,0,0,0,0,0,null,"FrühJ+Jahr",{"$f":"AQ27+AQ49","v":25},25,25,25,0,0]
[null,30,{"$f":"C38","v":0},0,0,0,0,0,0,null,null,{"$f":"IF($I77=0,0,ROUND(SUM(C$48:C77),1))","v":0},{"$f":"IF($I77=0,0,ROUND(SUM(D$48:D77),1))","v":0},{"$f":"IF($I77=0,0,ROUND(SUM(E$48:E77),1))","v":0},{"$f":"IF($I77=0,0,ROUND(SUM(F$48:F77),1))","v":0},{"$f":"IF($I77=0,0,ROUND(SUM(G$48:G77),1))","v":0},{"$f":"IF($I77=0,0,ROUND(SUM(H$48:H77),1))","v":0},0,null,null,"","","","","","",null,"","","","","","",null,0,0,0,0,0,0,null,"Gesamt",{"$f":"AQ76+AQ73","v":50},50,50,50,0,0]
[null,31,{"$f":"C39","v":0},0,0,0,0,0,0,null,null,{"$f":"IF($I78=0,0,ROUND(SUM(C$48:C78),1))","v":0},{"$f":"IF($I78=0,0,ROUND(SUM(D$48:D78),1))","v":0},{"$f":"IF($I78=0,0,ROUND(SUM(E$48:E78),1))","v":0},{"$f":"IF($I78=0,0,ROUND(SUM(F$48:F78),1))","v":0},{"$f":"IF($I78=0,0,ROUND(SUM(G$48:G78),1))","v":0},{"$f":"IF($I78=0,0,ROUND(SUM(H$48:H78),1))","v":0},0,null,null,"","","","","","",null,"","","","","","",null,0,0,0,0,0,0,null,null,{"$f":"RANK(AQ73,$AQ73:$AV73)","v":1},1,1,1,5,5]
[null,32,{"$f":"C40","v":0},0,0,0,0,0,0,null,null,{"$f":"IF($I79=0,0,ROUND(SUM(C$48:C79),1))","v":0},{"$f":"IF($I79=0,0,ROUND(SUM(D$48:D79),1))","v":0},{"$f":"IF($I79=0,0,ROUND(SUM(E$48:E79),1))","v":0},{"$f":"IF($I79=0,0,ROUND(SUM(F$48:F79),1))","v":0},{"$f":"IF($I79=0,0,ROUND(SUM(G$48:G79),1))","v":0},{"$f":"IF($I79=0,0,ROUND(SUM(H$48:H79),1))","v":0},0,null,null,"","","","","","",null,"","","","","","",null,0,0,0,0,0,0,null,null,{"$f":"RANK(AQ74,$AQ74:$AV74)","v":1},1,1,1,5,5]
[null,33,{"$f":"C41","v":0},0,0,0,0,0,0,null,null,{"$f":"IF($I80=0,0,ROUND(SUM(C$48:C80),1))","v":0},{"$f":"IF($I80=0,0,ROUND(SUM(D$48:D80),1))","v":0},{"$f":"IF($I80=0,0,ROUND(SUM(E$48:E80),1))","v":0},{"$f":"IF($I80=0,0,ROUND(SUM(F$48:F80),1))","v":0},{"$f":"IF($I80=0,0,ROUND(SUM(G$48:G80),1))","v":0},{"$f":"IF($I80=0,0,ROUND(SUM(H$48:H80),1))","v":0},0,null,null,"","","","","","",null,"","","","","","",null,0,0,0,0,0,0,null,null,{"$f":"RANK(AQ75,$AQ75:$AV75)","v":1},1,1,1,1,1]
[null,34,{"$f":"C42","v":0},0,0,0,0,0,0,null,null,{"$f":"IF($I81=0,0,ROUND(SUM(C$48:C81),1))","v":0},{"$f":"IF($I81=0,0,ROUND(SUM(D$48:D81),1))","v":0},{"$f":"IF($I81=0,0,ROUND(SUM(E$48:E81),1))","v":0},{"$f":"IF($I81=0,0,ROUND(SUM(F$48:F81),1))","v":0},{"$f":"IF($I81=0,0,ROUND(SUM(G$48:G81),1))","v":0},{"$f":"IF($I81=0,0,ROUND(SUM(H$48:H81),1))","v":0},0,null,null,"","","","","","",null,"","","","","","",null,0,0,0,0,0,0,null,null,{"$f":"RANK(AQ76,$AQ76:$AV76)","v":1},1,1,1,5,5]
[null,{"$f":"Parameter!B15","v":"26/27"},{"$f":"ROUND(SUM(C48:C81),1)","v":0},0,0,0,0,0,0,null,null,null,null,null,null,null,null,null,null,null,{"$f":"SUM(U48:U81)/COUNT(U48:U81)","v":{"$error":"#DIV/0!"}},{"$error":"#DIV/0!"},{"$error":"#DIV/0!"},{"$error":"#DIV/0!"},{"$error":"#DIV/0!"},{"$error":"#DIV/0!"},null,null,null,null,null,null,null,null,null,null,null,null,null,null,null,null,{"$f":"RANK(AQ77,$AQ77:$AV77)","v":1},1,1,1,5,5]
[]
[null,1,{"$f":"COUNTIF(U$48:U$81,$B84)","v":0},0,0,0,{"$f":"COUNTIF(X$48:X$81,$B84)","v":0},0,0]
[null,2,0,0,0,0,0,0,0]
[null,3,0,0,0,0,0,0,0]
[null,4,0,0,0,0,0,0,0]

{"sheet":"Statistik1","index":4,"n_rows":42,"n_cols":129,"rows_kept":42,"cut":false,"hidden":false,"merged":[[1,45,1,50],[1,8,1,13],[1,20,1,25],[1,2,1,7],[1,14,1,19],[1,26,1,31],[1,33,1,38],[1,39,1,44]]}
[]
[null,{"$f":"Parameter!B15","v":"26/27"},"genaue Treffer",null,null,null,null,null,"Trend",null,null,null,null,null,"Nicht getroffen",null,null,null,null,null,"genau + Trend",null,null,null,null,null,"Tordifferenz"]
[null,"Runde",{"$f":"Parameter!C$1","v":"MA"},{"$f":"Parameter!D$1","v":"MN"},{"$f":"Parameter!E$1","v":"AH"},{"$f":"Parameter!F$1","v":"KS"},{"$f":"Parameter!G$1","v":"LM"},{"$f":"Parameter!H$1","v":"EN"},{"$f":"Parameter!C$1","v":"MA"},{"$f":"Parameter!D$1","v":"MN"},{"$f":"Parameter!E$1","v":"AH"},{"$f":"Parameter!F$1","v":"KS"},{"$f":"Parameter!G$1","v":"LM"},{"$f":"Parameter!H$1","v":"EN"},{"$f":"Parameter!C$1","v":"MA"},{"$f":"Parameter!D$1","v":"MN"},{"$f":"Parameter!E$1","v":"AH"},{"$f":"Parameter!F$1","v":"KS"},{"$f":"Parameter!G$1","v":"LM"},{"$f":"Parameter!H$1","v":"EN"},{"$f":"Parameter!C$1","v":"MA"},{"$f":"Parameter!D$1","v":"MN"},{"$f":"Parameter!E$1","v":"AH"},{"$f":"Parameter!F$1","v":"KS"},{"$f":"Parameter!G$1","v":"LM"},{"$f":"Parameter!H$1","v":"EN"},{"$f":"Parameter!C$1","v":"MA"},{"$f":"Parameter!D$1","v":"MN"},{"$f":"Parameter!E$1","v":"AH"},{"$f":"Parameter!F$1","v":"KS"},{"$f":"Parameter!G$1","v":"LM"},{"$f":"Parameter!H$1","v":"EN"}]
[null,1]
[null,2]
[null,3]
[null,4]
[null,5,null,null,null,null,null,null,null,null,null,null,null,null,null,null,null,null,null,null,null,null,null,null,null,null,null,null,null,null,null,null,null,null,null,null,null,null,null,null,null,null,null,null,null,null,null,null,null,null,null,null,null,null,null,null,null,null,null,null,null,null,null,null,null,null,null,null,null,null,null,null,null,null,null,null,null,null,null,null,null,null,null,null,null,null,null,null,null,null,null,null,null,null,null,null,null,null,null,null,null,null,null,null,null,null,null,null,null,null,null,null,null,null,null,null,null,null,null,null,null,null,null,null,75,75,75,75,75]
[null,6]
[null,7]
[null,8]
[null,9]
[null,10]
[null,11]
[null,12]
[null,13]
[null,14]
[null,15]
[null,16]
[null,17]
[null,18]
[null,19]
[null,20]
[null,21]
[null,22]
[null,23]
[null,24]
[null,25]
[null,26]
[null,27]
[null,28]
[null,29]
[null,30]
[null,31]
[null,32]
[null,33]
[null,34]
[null,"Ges",{"$f":"SUM(C4:C37)","v":0},{"$f":"SUM(D4:D37)","v":0},{"$f":"SUM(E4:E37)","v":0},{"$f":"SUM(F4:F37)","v":0},null,null,{"$f":"SUM(I4:I37)","v":0},0,0,0,null,null,{"$f":"SUM(O4:O37)","v":0},{"$f":"SUM(P4:P37)","v":0},{"$f":"SUM(Q4:Q37)","v":0},{"$f":"SUM(R4:R37)","v":0},null,null,0,0,0,0,null,null,0,0,0,0]
[null,"H",{"$f":"SUM(C4:C20)","v":0},{"$f":"SUM(D4:D20)","v":0},{"$f":"SUM(E4:E20)","v":0},{"$f":"SUM(F4:F20)","v":0},null,null,{"$f":"SUM(I4:I20)","v":0},0,0,0,null,null,{"$f":"SUM(O4:O20)","v":0},{"$f":"SUM(P4:P20)","v":0},{"$f":"SUM(Q4:Q20)","v":0},{"$f":"SUM(R4:R20)","v":0},null,null,0,0,0,0,null,null,0,0,0,0]
[null,"F",{"$f":"SUM(C21:C37)","v":0},{"$f":"SUM(D21:D37)","v":0},{"$f":"SUM(E21:E37)","v":0},{"$f":"SUM(F21:F37)","v":0},null,null,{"$f":"SUM(I21:I37)","v":0},0,0,0,null,null,{"$f":"SUM(O21:O37)","v":0},{"$f":"SUM(P21:P37)","v":0},{"$f":"SUM(Q21:Q37)","v":0},{"$f":"SUM(R21:R37)","v":0},null,null,0,0,0,0,null,null,0,0,0,0]
[]
[null,null,{"$f":"MAX(C4:F37)","v":0},null,null,null,null,null,{"$f":"MAX(I4:L37)","v":0},null,null,null,null,null,{"$f":"MAX(O4:R37)","v":0},null,null,null,null,null,{"$f":"MAX(U4:X37)","v":0},null,null,null,null,null,{"$f":"MAX(AA4:AD37)","v":0}]

{"sheet":"Statistik2","index":5,"n_rows":105,"n_cols":112,"rows_kept":105,"cut":false,"hidden":false,"merged":[[1,1,1,4],[1,6,1,15],[1,17,1,20],[1,22,1,25],[5,17,5,18],[5,22,5,23],[2,17,2,18],[2,22,2,23],[3,17,3,18],[3,22,3,23],[4,17,4,18],[4,22,4,23]]}
[]
[null,{"$f":"Parameter!B15&\" Ergebnisse\"","v":"26/27 Ergebnisse"},null,null,null,null,{"$f":"Parameter!B15&\" getippt\"","v":"26/27 getippt"},null,null,null,null,null,null,null,null,null,null,"Ergebnisse",null,null,null,null,"getippt",null,null,null,{"$f":"Parameter!$C$1","v":"MA"},{"$f":"Parameter!$D$1","v":"MN"},{"$f":"Parameter!$E$1","v":"AH"},{"$f":"Parameter!$F$1","v":"KS"},{"$f":"Parameter!$G$1","v":"LM"},{"$f":"Parameter!$H$1","v":"EN"},{"$f":"Parameter!$C$1","v":"MA"},{"$f":"Parameter!$D$1","v":"MN"},{"$f":"Parameter!$E$1","v":"AH"},{"$f":"Parameter!$F$1","v":"KS"},{"$f":"Parameter!$G$1","v":"LM"},{"$f":"Parameter!$H$1","v":"EN"}]
[null,"M1","M2","Rang","Anz",null,"M1","M2","Rang","Anz",{"$f":"Parameter!C$1","v":"MA"},{"$f":"Parameter!D$1","v":"MN"},{"$f":"Parameter!E$1","v":"AH"},{"$f":"Parameter!F$1","v":"KS"},{"$f":"Parameter!G$1","v":"LM"},{"$f":"Parameter!H$1","v":"EN"},null,"Tipp 1",null,null,{"$f":"T3/T$6","v":{"$error":"#DIV/0!"}},null,"Tipp 1",null,{"$f":"SUM(AA3:AF3)","v":0},{"$f":"Y3/Y$6","v":{"$error":"#DIV/0!"}},null,null,null,null,null,null,{"$f":"AA3/AA$6","v":{"$error":"#DIV/0!"}},{"$f":"AB3/AB$6","v":{"$error":"#DIV/0!"}},{"$error":"#DIV/0!"},{"$error":"#DIV/0!"},{"$error":"#DIV/0!"},{"$error":"#DIV/0!"}]
[null,0,0,{"$f":"IF(E4>0,RANK(E4,E$4:E$103,0),\"\")","v":""},null,null,0,0,{"$f":"IF(J4>0,RANK(J4,J$4:J$103,0),\"\")","v":""},null,null,null,null,null,null,null,null,"Tipp 2",null,null,{"$f":"T4/T$6","v":{"$error":"#DIV/0!"}},null,"Tipp 2",null,{"$f":"SUM(AA4:AF4)","v":0},{"$f":"Y4/Y$6","v":{"$error":"#DIV/0!"}},null,null,null,null,null,null,{"$f":"AA4/AA$6","v":{"$error":"#DIV/0!"}},{"$error":"#DIV/0!"},{"$error":"#DIV/0!"},{"$error":"#DIV/0!"},{"$error":"#DIV/0!"},{"$error":"#DIV/0!"}]
[null,0,1,"",null,null,0,1,"",null,null,null,null,null,null,null,null,"Tipp X",null,null,{"$f":"T5/T$6","v":{"$error":"#DIV/0!"}},null,"Tipp X",null,{"$f":"SUM(AA5:AF5)","v":0},{"$f":"Y5/Y$6","v":{"$error":"#DIV/0!"}},null,null,null,null,null,null,{"$f":"AA5/AA$6","v":{"$error":"#DIV/0!"}},{"$error":"#DIV/0!"},{"$error":"#DIV/0!"},{"$error":"#DIV/0!"},{"$error":"#DIV/0!"},{"$error":"#DIV/0!"}]
[null,0,2,"",null,null,0,2,"",null,null,null,null,null,null,null,null,"Gesamt",null,{"$f":"SUM(T3:T5)","v":0},{"$f":"T6/T$6","v":{"$error":"#DIV/0!"}},null,"Gesamt",null,{"$f":"SUM(Y3:Y5)","v":0},{"$f":"Y6/Y$6","v":{"$error":"#DIV/0!"}},{"$f":"SUM(AA3:AA5)","v":0},0,0,0,0,0,{"$f":"AA6/AA$6","v":{"$error":"#DIV/0!"}},{"$error":"#DIV/0!"},{"$error":"#DIV/0!"},{"$error":"#DIV/0!"},{"$error":"#DIV/0!"},{"$error":"#DIV/0!"}]
[null,0,3,"",null,null,0,3,""]
[null,0,4,"",null,null,0,4,"",null,null,null,null,null,null,null,null,null,null,null,null,null,null,null,null,null,null,null,null,null,null,null,null,null,null,null,null,null,null,null,null,null,null,null,null,null,null,null,null,null,null,null,null,null,null,null,null,null,null,null,null,null,null,null,null,null,null,null,null,null,null,null,null,null,null,null,null,null,null,null,null,null,null,null,null,null,null,null,null,null,null,null,null,null,null,null,null,null,null,null,null,null,null,null,null,null,null,75,75,75,75,75]
[null,0,5,"",null,null,0,5,""]
[null,0,6,"",null,null,0,6,""]
[null,0,7,"",null,null,0,7,""]
[null,0,8,"",null,null,0,8,""]
[null,0,9,"",null,null,0,9,""]
[null,1,0,"",null,null,1,0,""]
[null,1,1,"",null,null,1,1,""]
[null,1,2,"",null,null,1,2,""]
[null,1,3,"",null,null,1,3,""]
[null,1,4,"",null,null,1,4,""]
[null,1,5,"",null,null,1,5,""]
[null,1,6,"",null,null,1,6,""]
[null,1,7,"",null,null,1,7,""]
[null,1,8,"",null,null,1,8,""]
[null,1,9,"",null,null,1,9,""]
[null,2,0,"",null,null,2,0,""]
[null,2,1,"",null,null,2,1,""]
[null,2,2,"",null,null,2,2,""]
[null,2,3,"",null,null,2,3,""]
[null,2,4,"",null,null,2,4,""]
[null,2,5,"",null,null,2,5,""]
[null,2,6,"",null,null,2,6,""]
[null,2,7,"",null,null,2,7,""]
[null,2,8,"",null,null,2,8,""]
[null,2,9,"",null,null,2,9,""]
[null,3,0,"",null,null,3,0,""]
[null,3,1,"",null,null,3,1,""]
[null,3,2,{"$f":"IF(E36>0,RANK(E36,E$4:E$103,0),\"\")","v":""},null,null,3,2,{"$f":"IF(J36>0,RANK(J36,J$4:J$103,0),\"\")","v":""}]
[null,3,3,"",null,null,3,3,""]
[null,3,4,"",null,null,3,4,""]
[null,3,5,"",null,null,3,5,""]
[null,3,6,"",null,null,3,6,""]
[null,3,7,"",null,null,3,7,""]
[null,3,8,"",null,null,3,8,""]
[null,3,9,"",null,null,3,9,""]
[null,4,0,"",null,null,4,0,""]
[null,4,1,"",null,null,4,1,""]
[null,4,2,"",null,null,4,2,""]
[null,4,3,"",null,null,4,3,""]
[null,4,4,"",null,null,4,4,""]
[null,4,5,"",null,null,4,5,""]
[null,4,6,"",null,null,4,6,""]
[null,4,7,"",null,null,4,7,""]
[null,4,8,"",null,null,4,8,""]
[null,4,9,"",null,null,4,9,""]
[null,5,0,"",null,null,5,0,""]
[null,5,1,"",null,null,5,1,""]
[null,5,2,"",null,null,5,2,""]
[null,5,3,"",null,null,5,3,""]
[null,5,4,"",null,null,5,4,""]
[null,5,5,"",null,null,5,5,""]
[null,5,6,"",null,null,5,6,""]
[null,5,7,"",null,null,5,7,""]
[null,5,8,"",null,null,5,8,""]
[null,5,9,"",null,null,5,9,""]
[null,6,0,"",null,null,6,0,""]
[null,6,1,"",null,null,6,1,""]
[null,6,2,"",null,null,6,2,""]
[null,6,3,"",null,null,6,3,""]
[null,6,4,{"$f":"IF(E68>0,RANK(E68,E$4:E$103,0),\"\")","v":""},null,null,6,4,{"$f":"IF(J68>0,RANK(J68,J$4:J$103,0),\"\")","v":""}]
[null,6,5,"",null,null,6,5,""]
[null,6,6,"",null,null,6,6,""]
[null,6,7,"",null,null,6,7,""]
[null,6,8,"",null,null,6,8,""]
[null,6,9,"",null,null,6,9,""]
[null,7,0,"",null,null,7,0,""]
[null,7,1,"",null,null,7,1,""]
[null,7,2,"",null,null,7,2,""]
[null,7,3,"",null,null,7,3,""]
[null,7,4,"",null,null,7,4,""]
[null,7,5,"",null,null,7,5,""]
[null,7,6,"",null,null,7,6,""]
[null,7,7,"",null,null,7,7,""]
[null,7,8,"",null,null,7,8,""]
[null,7,9,"",null,null,7,9,""]
[null,8,0,"",null,null,8,0,""]
[null,8,1,"",null,null,8,1,""]
[null,8,2,"",null,null,8,2,""]
[null,8,3,"",null,null,8,3,""]
[null,8,4,"",null,null,8,4,""]
[null,8,5,"",null,null,8,5,""]
[null,8,6,"",null,null,8,6,""]
[null,8,7,"",null,null,8,7,""]
[null,8,8,"",null,null,8,8,""]
[null,8,9,"",null,null,8,9,""]
[null,9,0,"",null,null,9,0,""]
[null,9,1,"",null,null,9,1,""]
[null,9,2,"",null,null,9,2,""]
[null,9,3,"",null,null,9,3,""]
[null,9,4,"",null,null,9,4,""]
[null,9,5,"",null,null,9,5,""]
[null,9,6,{"$f":"IF(E100>0,RANK(E100,E$4:E$103,0),\"\")","v":""},null,null,9,6,{"$f":"IF(J100>0,RANK(J100,J$4:J$103,0),\"\")","v":""}]
[null,9,7,"",null,null,9,7,""]
[null,9,8,"",null,null,9,8,""]
[null,9,9,"",null,null,9,9,"ED"]
[]
[null,null,null,null,{"$f":"SUM(E4:E103)","v":0}]

{"sheet":"Statistik3","index":6,"n_rows":87,"n_cols":141,"rows_kept":87,"cut":false,"hidden":false,"merged":[[57,34,57,39],[1,57,1,62],[1,0,1,6],[1,34,1,39],[1,21,1,26],[1,27,1,32],[1,15,1,20],[1,9,1,14],[1,40,1,45],[1,47,1,52],[57,47,57,52],[77,47,77,52],[49,1,49,6],[49,0,50,0],[57,40,57,45],[77,0,77,6],[77,9,77,14],[77,15,77,20],[77,21,77,26],[77,27,77,32],[77,34,77,39],[77,40,77,45],[57,0,57,6],[57,9,57,14],[57,15,57,20],[57,21,57,26],[57,27,57,32]]}
[null,null,null,null,null,null,null,null,null,null,null,null,null,null,null,null,null,null,null,null,null,null,null,null,null,null,null,null,null,null,null,null,null,null,null,null,null,null,null,null,null,null,null,null,null,null,"^^"]
["Ränge je Saisonhälfte/Saison",null,null,null,null,null,null,null,"Saison","Einsatz",null,null,null,null,null,"Auszahlung",null,null,null,null,null,"Geldgewinn",null,null,null,null,null,"Seidl",null,null,null,null,null,"Preis","Seidl-Gewinn",null,null,null,null,null,"Gesamtgewinn",null,null,null,null,null,null,"Anzahl Rundensiege"]
["Saison","MA","MN","AH","KS","LM","EN",null,null,"MA","MN","AH","KS","LM","EN","MA","MN","AH","KS","LM","EN","MA","MN","AH","KS","LM","EN","MA","MN","AH","KS","LM","EN",null,"MA","MN","AH","KS","LM","EN","MA","MN","AH","KS","LM","EN",null,"MA","MN","AH","KS","LM","EN"]
["Herbst 10/11 (ab 08)",3,2,"-",1,"-",4,null,{"$f":"A4","v":"Herbst 10/11 (ab 08)"},10,10,null,10,null,10,4,12,null,24,null,0,{"$f":"P4-J4","v":-6},{"$f":"Q4-K4","v":2},null,{"$f":"S4-M4","v":14},null,{"$f":"U4-O4","v":-10},6,6,null,-6,null,-6,2.6,{"$f":"AB4*$AH4","v":15.600000000000001},{"$f":"AC4*$AH4","v":15.600000000000001},null,{"$f":"AE4*$AH4","v":-15.600000000000001},null,{"$f":"AG4*$AH4","v":-15.600000000000001},{"$f":"V4+AI4","v":9.6000000000000014},{"$f":"W4+AJ4","v":17.600000000000001},null,{"$f":"Y4+AL4","v":-1.6000000000000014},null,{"$f":"AA4+AN4","v":-25.6},null,4,4,null,1,null,1]
["Frühjahr 10/11",1,2,"-",4,"-",3,null,{"$f":"A5","v":"Frühjahr 10/11"},17,17,null,17,null,17,40.799999999999997,20.399999999999999,null,0,null,6.8,23.799999999999997,3.3999999999999986,null,-17,null,-10.199999999999999,{"$f":"22-9","v":13},{"$f":"16-11","v":5},null,{"$f":"3-16","v":-13},null,{"$f":"9-14","v":-5},2.6,33.800000000000004,13,null,-33.800000000000004,null,-13,57.6,16.399999999999999,null,-50.800000000000004,null,-23.2,null,8,6,null,1,null,3]
["Herbst 11/12",1,3,"-",4,"-",2,null,"Herbst 11/12",17,17,null,17,null,17,40.799999999999997,6.8,null,0,null,20.399999999999999,23.799999999999997,-10.199999999999999,null,-17,null,3.3999999999999986,-6,6,null,-2,null,2,2.6,-15.600000000000001,15.600000000000001,null,-5.2,null,5.2,8.1999999999999957,5.4000000000000021,null,-22.2,null,8.5999999999999979,null,3,6,null,4,null,5]
["Frühjahr 11/12",1,3,"-",2,"-",4,null,"Frühjahr 11/12",17,17,null,17,null,17,40.799999999999997,6.8,null,20.399999999999999,null,0,23.799999999999997,-10.199999999999999,null,3.3999999999999986,null,-17,7,-5,null,7,null,-9,2.7,18.900000000000002,-13.5,null,18.900000000000002,null,-24.3,42.7,-23.7,null,22.3,null,-41.3,null,6,3,null,6,null,2]
["Herbst 12/13",1,2,"-",4,3,5,null,"Herbst 12/13",17,17,null,17,17,17,51,25.5,null,0,8.5,0,34,8.5,null,-17,{"$f":"T8-N8","v":-8.5},-17,18,8,null,-17,-2,-7,2.7,48.6,21.6,null,-45.900000000000006,{"$f":"AF8*$AH8","v":-5.4},-18.900000000000002,82.6,30.1,null,-62.900000000000006,{"$f":"Z8+AM8","v":-13.9},-35.900000000000006,null,7,5,null,0,3,2,null,null,null,null,null,null,null,null,null,null,null,null,null,null,null,null,null,null,null,null,null,null,null,null,null,null,null,null,null,null,null,null,null,null,null,null,null,null,null,null,null,null,null,null,null,null,null,null,null,null,null,null,null,null,null,null,null,null,null,null,null,null,null,null,null,null,null,null,null,null,null,null,null,null,null,null,null,null,null,null,null,null,null,75,75,75,75,75]
["Frühjahr 12/13",2,1,"-",4,5,3,null,"Frühjahr 12/13",17,17,null,17,17,17,25.5,51,null,0,0,8.5,8.5,34,null,-17,-17,-8.5,-13,22,null,-13,-3,7,2.8,-36.4,61.599999999999994,null,-36.4,-8.3999999999999986,19.599999999999998,-27.9,95.6,null,-53.4,-25.4,11.099999999999998,null,1,8,null,1,3,5]
["Herbst 13/14",1,4,"-",2,5,3,null,"Herbst 13/14",17,17,null,17,17,17,51,0,null,25.5,0,8.5,34,-17,null,8.5,-17,-8.5,3,-2,null,-2,-7,8,2.8,8.3999999999999986,-5.6,null,-5.6,-19.599999999999998,22.4,42.4,-22.6,null,2.9000000000000004,-36.599999999999994,13.899999999999999,null,4,3,null,3,2,5]
["Frühjahr 13/14",1,3,"-",5,4,2,null,"Frühjahr 13/14",17,17,null,17,17,17,51,8.5,null,0,0,25.5,34,-8.5,null,-17,-17,8.5,3,-2,null,-2,-2,3,2.9,8.6999999999999993,-5.8,null,-5.8,-5.8,8.6999999999999993,42.7,-14.3,null,-22.8,-22.8,17.2,null,4,3,null,3,3,4]
["13/14",1,4,"-",3,5,2,null,"13/14",16,16,null,16,16,16,48,0,null,8,0,24,32,-16,null,-8,-16,8,null,null,null,null,null,null,null,null,null,null,null,null,null,32,-16,null,-8,-16,8]
["Herbst 14/15",1,3,"-",4,5,2,null,"Herbst 14/15",17,17,null,17,17,17,51,8.5,null,0,0,25.5,34,-8.5,null,-17,-17,8.5,16,-4,null,1,-9,-4,2.9,46.4,-11.6,null,2.9,-26.099999999999998,-11.6,80.400000000000006,-20.100000000000001,null,-14.1,-43.099999999999994,-3.0999999999999996,null,7,3,null,4,2,3]
["Frühjahr 14/15",4,1,"-",2,5,3,null,"Frühjahr 14/15",17,17,null,17,17,17,0,51,null,25.5,0,8.5,-17,34,null,8.5,-17,-8.5,-7,8,null,8,-12,3,2.9,-20.3,23.2,null,23.2,-34.799999999999997,8.6999999999999993,-37.299999999999997,57.2,null,31.7,-51.8,0.19999999999999929,null,2,5,null,5,1,4]
["14/15",2,1,"-",4,5,3,null,"14/15",16,16,null,16,16,16,24,48,null,0,0,8,8,32,null,-16,-16,-8,null,null,null,null,null,null,null,null,null,null,null,null,null,8,32,null,-16,-16,-8]
["Herbst 15/16",1,4,"-",2,"-",3,null,"Herbst 15/16",17,17,null,17,null,17,40.799999999999997,0,null,20.399999999999999,null,6.8,23.799999999999997,-17,null,3.3999999999999986,null,-10.199999999999999,1,-7,null,9,null,-3,2.9,2.9,-20.3,null,26.099999999999998,null,-8.6999999999999993,26.699999999999996,-37.299999999999997,null,29.499999999999996,null,-18.899999999999999,null,5,3,null,7,null,4]
["Frühjahr 15/16",2,3,"-",1,"-",4,null,"Frühjahr 15/16",17,17,null,17,null,17,20.399999999999999,6.8,null,40.799999999999997,null,0,3.3999999999999986,-10.199999999999999,null,23.799999999999997,null,-17,-6,-6,null,6,null,6,2.9,-17.399999999999999,-17.399999999999999,null,17.399999999999999,null,17.399999999999999,-14,-27.599999999999998,null,41.199999999999996,null,0.39999999999999858,null,3,3,null,6,null,6]
["15/16",2,3,"-",1,"-",4,null,"15/16",16,16,null,16,null,16,19.2,6.4,null,38.4,null,0,3.1999999999999993,-9.6,null,22.4,null,-16,null,null,null,null,null,null,null,null,null,null,null,null,null,3.1999999999999993,-9.6,null,22.4,null,-16]
["Herbst 16/17",3,1,"-",2,"-",4,null,"Herbst 16/17",17,17,null,17,null,17,6.8,40.799999999999997,null,20.399999999999999,null,0,-10.199999999999999,23.799999999999997,null,3.3999999999999986,null,-17,-5,3,null,3,null,-1,2.9,-14.5,8.6999999999999993,null,8.6999999999999993,null,-2.9,-24.7,32.5,null,12.099999999999998,null,-19.899999999999999,null,3,5,null,5,null,4]
["Frühjahr 16/17",1,4,"-",2,"-",3,null,"Frühjahr 16/17",17,17,null,17,null,17,40.799999999999997,0,null,20.399999999999999,null,6.8,23.799999999999997,-17,null,3.3999999999999986,null,-10.199999999999999,18,-6,null,-10,null,-2,3.1,{"$f":"AB20*$AH20","v":55.800000000000004},-18.600000000000001,null,-31,null,-6.2,{"$f":"V20+AI20","v":79.599999999999994},-35.6,null,-27.6,null,-16.399999999999999,null,9,3,null,2,null,4]
["16/17",1,4,"-",2,"-",3,null,"16/17",16,16,null,16,null,16,38.4,0,null,19.2,null,6.4,22.4,-16,null,3.1999999999999993,null,-9.6,null,null,null,null,null,null,null,null,null,null,null,null,null,22.4,-16,null,3.1999999999999993,null,-9.6]
["Herbst 17/18",4,3,"-",1,"-",2,null,"Herbst 17/18",17,17,null,17,null,17,0,6.8,null,40.799999999999997,null,20.399999999999999,-17,-10.199999999999999,null,23.799999999999997,null,3.3999999999999986,-11,5,null,-3,null,9,3.1,-34.1,15.5,null,-9.3000000000000007,null,27.900000000000002,-51.1,5.3000000000000007,null,14.499999999999996,null,31.3,null,2,6,null,4,null,7]
["Frühjahr 17/18",1,4,"-",2,"-",3,null,"Frühjahr 17/18",17,17,null,17,null,17,40.799999999999997,0,null,20.399999999999999,null,6.8,23.799999999999997,-17,null,3.3999999999999986,null,-10.199999999999999,9,-7,null,-3,null,1,3.1,27.900000000000002,-21.7,null,-9.3000000000000007,null,3.1,51.7,-38.700000000000003,null,-5.9000000000000021,null,-7.1,null,7,3,null,4,null,5]
["17/18",3,4,"-",1,"-",2,null,"17/18",16,16,null,16,null,16,6.4,0,null,38.4,null,19.2,-9.6,-16,null,22.4,null,3.1999999999999993,null,null,null,null,null,null,null,null,null,null,null,null,null,-9.6,-16,null,22.4,null,3.1999999999999993]
["Herbst 18/19",2,1,4,3,"-","-",null,"Herbst 18/19",17,17,17,17,null,null,20.399999999999999,40.799999999999997,0,6.8,null,null,3.3999999999999986,23.799999999999997,{"$f":"R25-L25","v":-17},-10.199999999999999,null,null,-7,5,-3,5,null,null,3.2,-22.400000000000002,16,{"$f":"AD25*$AH25","v":-9.6000000000000014},16,null,null,-19.000000000000004,39.799999999999997,{"$f":"X25+AK25","v":-26.6},5.8000000000000007,null,null,null,3,6,4,6]
["Frühjahr 18/19",2,1,3,4,"-","-",null,"Frühjahr 18/19",17,17,17,17,null,null,20.399999999999999,40.799999999999997,6.8,0,null,null,3.3999999999999986,23.799999999999997,-10.199999999999999,-17,null,null,-2,10,-6,-2,null,null,3.4,-6.8,34,-20.399999999999999,-6.8,null,null,-3.4000000000000012,57.8,-30.599999999999998,-23.8,null,null,null,4,7,3,4]
["18/19",2,1,4,3,"-","-",null,"18/19",16,16,16,16,null,null,19.2,38.4,0,6.4,null,null,3.1999999999999993,22.4,-16,-9.6,null,null,null,null,null,null,null,null,null,null,null,null,null,null,null,3.1999999999999993,22.4,-16,-9.6]
["Herbst 19/20",1,2,3,4,"-","-",null,"Herbst 19/20",17,17,17,17,null,null,40.799999999999997,20.399999999999999,6.8,0,null,null,23.799999999999997,3.3999999999999986,-10.199999999999999,-17,null,null,2,6,-6,-2,null,null,3.4,6.8,20.399999999999999,-20.399999999999999,-6.8,null,null,30.599999999999998,23.799999999999997,-30.599999999999998,-23.8,null,null,null,5,6,3,4]
["Frühjahr 19/20",1,3,2,4,"-","-",null,"Frühjahr 19/20",17,17,17,17,null,null,40.799999999999997,6.8,20.399999999999999,0,null,null,23.799999999999997,-10.199999999999999,3.3999999999999986,-17,null,null,18,2,-6,-14,null,null,3.4,61.199999999999996,6.8,-20.399999999999999,-47.6,null,null,85,-3.3999999999999995,-17,-64.599999999999994,null,null,null,9,5,3,1]
["19/20",1,2,3,4,"-","-",null,"19/20",16,16,16,16,null,null,38.4,19.2,6.4,0,null,null,22.4,3.1999999999999993,-9.6,-16,null,null,null,null,null,null,null,null,null,null,null,null,null,null,null,22.4,3.1999999999999993,-9.6,-16]
["Herbst 20/21",4,1,2,3,"-","-",null,{"$f":"A31","v":"Herbst 20/21"},17,17,17,17,null,null,0,40.799999999999997,20.399999999999999,6.8000000000000007,null,null,-17,23.799999999999997,3.3999999999999986,-10.199999999999999,null,null,-1,3,7,-9,null,null,3.4,-3.4,10.199999999999999,23.8,-30.599999999999998,null,null,-20.399999999999999,34,27.2,-40.799999999999997,null,null,null,4,5,6,2]
["Frühjahr 20/21",3,4,2,1,"-","-",null,"Frühjahr 20/21",17,17,17,17,null,null,6.8000000000000007,0,20.399999999999999,40.799999999999997,null,null,-10.199999999999999,-17,3.3999999999999986,23.799999999999997,null,null,-5,-5,-1,11,null,null,3.4,-17,-17,-3.4,37.4,null,null,-27.2,-34,0,61.199999999999996,null,null,null,3,3,4,7]
["20/21",4,3,2,1,"-","-",null,"20/21",16,16,16,16,null,null,0,6.4,19.2,38.4,null,null,-16,-9.6,3.1999999999999993,22.4,null,null,null,null,null,null,null,null,null,null,null,null,null,null,null,-16,-9.6,3.1999999999999993,22.4]
["Herbst 21/22",2,1,4,2,"-","-",null,{"$f":"A34","v":"Herbst 21/22"},17,17,17,17,null,null,13.6,40.799999999999997,0,13.6,null,null,-3.4000000000000004,23.799999999999997,-17,-3.4000000000000004,null,null,-9,11,-5,3,null,null,3.6,-32.4,39.6,-18,10.8,null,null,-35.799999999999997,63.4,-35,7.4,null,null,null,2,7,3,5]
["Frühjahr 21/22",3,1,2,4,"-","-",null,{"$f":"A35","v":"Frühjahr 21/22"},17,17,17,17,null,null,6.8000000000000007,40.799999999999997,20.399999999999999,0,null,null,-10.199999999999999,23.799999999999997,3.3999999999999986,-17,null,null,2,2,2,-6,null,null,3.8,7.6,7.6,7.6,-22.799999999999997,null,null,-2.5999999999999996,31.4,10.999999999999998,-39.799999999999997,null,null,null,5,5,5,3]
["21/22",3,1,2,4,"-","-",null,{"$f":"A36","v":"21/22"},16,16,16,16,null,null,6.4,38.4,19.2,0,null,null,-9.6,22.4,3.1999999999999993,-16,null,null,null,null,null,null,null,null,null,null,null,null,null,null,null,-9.6,22.4,3.1999999999999993,-16]
["Herbst 22/23",2,1,3,4,"-","-",null,"Herbst 22/23",20,20,20,20,null,null,24,48,8,0,null,null,4,28,-12,-20,null,null,1,-7,9,-3,null,null,4,4,-28,36,-12,null,null,8,0,24,-32,null,null,null,5,3,7,4]
["Frühjahr 22/23",2,1,3,4,"-","-",null,"Frühjahr 22/23",20,20,20,20,null,null,24,48,8,0,null,null,4,28,-12,-20,null,null,-3,9,1,-7,null,null,4.2,-12.600000000000001,37.800000000000004,4.2,-29.400000000000002,null,null,-8.6000000000000014,65.800000000000011,-7.8,-49.400000000000006,null,null,null,4,7,5,3]
["22/23",2,1,3,4,"-","-",null,"22/23",20,20,20,20,null,null,24,48,8,0,null,null,4,28,-12,-20,null,null,null,null,null,null,null,null,null,null,null,null,null,null,null,4,28,-12,-20]
["Herbst 23/24",1,2,3,4,"-","-",null,"Herbst 23/24",20,20,20,20,null,null,48,24,8,0,null,null,28,4,-12,-20,null,null,9,-3,-3,-3,null,null,4.2,37.800000000000004,-12.600000000000001,-12.600000000000001,-12.600000000000001,null,null,65.800000000000011,-8.6000000000000014,-24.6,-32.6,null,null,null,7,4,4,4]
["Frühjahr 23/24",2,1,4,3,"-","-",null,"Frühjahr 23/24",20,20,20,20,null,null,24,48,0,8,null,null,4,28,-20,-12,null,null,-10,14,-10,6,null,null,4.2,-42,58.800000000000004,-42,25.200000000000003,null,null,-38,86.800000000000011,-62,13.200000000000003,null,null,null,2,8,2,6]
["23/24",2,1,4,3,"-","-",null,"23/24",20,20,20,20,null,null,24,48,0,8,null,null,4,28,-20,-12,null,null,null,null,null,null,null,null,null,null,null,null,null,null,null,4,28,-20,-12]
["Herbst 24/25",1,4,2,3,"-","-",null,"Herbst 24/25",25,25,25,25,null,null,60,0,30,10,null,null,35,-25,5,-15,null,null,0,0,4,-4,null,null,4.4000000000000004,0,0,17.600000000000001,-17.600000000000001,null,null,35,-25,22.6,-32.6,null,null,null,5,5,6,4]
["Frühjahr 24/25",3,2,1,4,"-","-",null,"Frühjahr 24/25",25,25,25,25,null,null,10,30,60,0,null,null,-15,5,35,-25,null,null,4,4,4,-12,null,null,4.4000000000000004,17.600000000000001,17.600000000000001,17.600000000000001,-52.800000000000004,null,null,2.6000000000000014,22.6,52.6,-77.800000000000011,null,null,null,6,6,6,2]
["24/25",null,null,null,null,null,null,null,null,null,null,null,null,null,null,null,null,null,null,null,null,0,0,0,0,null,null,null,null,null,null,null,null,null,0,0,0,0,null,null,0,0,0,0]
["Herbst 25/26",{"$f":"Übersicht!AQ3","v":""},{"$f":"Übersicht!AR3","v":""},{"$f":"Übersicht!AS3","v":""},{"$f":"Übersicht!AT3","v":""},"-","-",null,"Herbst 25/26",{"$f":"Parameter!C2","v":25},{"$f":"Parameter!D2","v":25},{"$f":"Parameter!E2","v":25},{"$f":"Parameter!F2","v":25},null,null,{"$f":"Übersicht!AQ5","v":25},{"$f":"Übersicht!AR5","v":25},{"$f":"Übersicht!AS5","v":25},{"$f":"Übersicht!AT5","v":25},null,null,0,0,0,0,null,null,{"$f":"Seidl!B20","v":0},{"$f":"Seidl!C20","v":0},{"$f":"Seidl!D20","v":0},{"$f":"Seidl!E20","v":0},null,null,{"$f":"Parameter!B16","v":4.5999999999999996},0,0,0,0,null,null,0,0,0,0,null,null,null,{"$f":"COUNTIF(Übersicht!U4:U20,1)","v":0},{"$f":"COUNTIF(Übersicht!V4:V20,1)","v":0},{"$f":"COUNTIF(Übersicht!W4:W20,1)","v":0},{"$f":"COUNTIF(Übersicht!X4:X20,1)","v":0},{"$f":"COUNTIF(Übersicht!Y4:Y20,1)","v":0},{"$f":"COUNTIF(Übersicht!Z4:Z20,1)","v":0}]
["Frühjahr 25/26",{"$f":"Übersicht!AQ25","v":""},{"$f":"Übersicht!AR25","v":""},{"$f":"Übersicht!AS25","v":""},{"$f":"Übersicht!AT25","v":""},"-","-",null,"Frühjahr 25/26",{"$f":"Parameter!C3","v":25},{"$f":"Parameter!D3","v":25},{"$f":"Parameter!E3","v":25},{"$f":"Parameter!F3","v":25},null,null,{"$f":"Übersicht!AQ27","v":25},{"$f":"Übersicht!AR27","v":25},{"$f":"Übersicht!AS27","v":25},{"$f":"Übersicht!AT27","v":25},null,null,0,0,0,0,null,null,{"$f":"Seidl!J20","v":0},{"$f":"Seidl!K20","v":0},{"$f":"Seidl!L20","v":0},{"$f":"Seidl!M20","v":0},null,null,{"$f":"Parameter!B17","v":4.5999999999999996},0,0,0,0,null,null,0,0,0,0,null,null,null,{"$f":"COUNTIF(Übersicht!U26:U42,1)","v":0},{"$f":"COUNTIF(Übersicht!V26:V42,1)","v":0},{"$f":"COUNTIF(Übersicht!W26:W42,1)","v":0},{"$f":"COUNTIF(Übersicht!X26:X42,1)","v":0},{"$f":"COUNTIF(Übersicht!Y26:Y42,1)","v":0},{"$f":"COUNTIF(Übersicht!Z26:Z42,1)","v":0}]
["25/26"]
["Bundesliga",{"$f":"RANK(AO49,$AO49:$AT49)","v":1},{"$f":"RANK(AP49,$AO49:$AT49)","v":2},{"$f":"RANK(AQ49,$AO49:$AT49)","v":4},{"$f":"RANK(AR49,$AO49:$AT49)","v":6},{"$f":"RANK(AS49,$AO49:$AT49)","v":5},{"$f":"RANK(AT49,$AO49:$AT49)","v":3},null,"Gesamt",{"$f":"SUM(J4:J48)","v":765},765,420,765,134,345,1143.0999999999995,976.89999999999986,312,551.40000000000009,8.5,202.10000000000002,378.09999999999991,211.89999999999998,-108,-213.60000000000002,-125.5,-142.89999999999998,45,75,-13,-74,-35,2,null,{"$f":"SUM(AI4:AI48)","v":127.10000000000002},251.50000000000003,-40,-250.29999999999998,-100.1,11.799999999999985,505.19999999999987,463.40000000000003,-148,-463.90000000000009,-225.59999999999997,-131.10000000000002,null,{"$f":"SUM(AV4:AV47)","v":139},{"$f":"SUM(AW4:AW47)","v":146},61,111,14,64]
["Rang","Anzahl"]
[null,"MA","MN","AH","KS","LM","EN"]
[1,{"$f":"COUNTIF(B$4:B$48,$A52)","v":17},16,1,7,0,0]
[2,13,7,7,9,0,6]
[3,7,9,7,7,1,9]
[4,4,9,5,17,1,5]
[5,0,0,0,1,6,1]
[]
["Ränge laut Gesamtgewinn",null,null,null,null,null,null,null,"Saison","Einsatz",null,null,null,null,null,"Auszahlung",null,null,null,null,null,{"$f":"V2","v":"Geldgewinn"},null,null,null,null,null,"Seidl",null,null,null,null,null,"Preis",{"$f":"AI2","v":"Seidl-Gewinn"},null,null,null,null,null,{"$f":"AO2","v":"Gesamtgewinn"},null,null,null,null,null,null,"Anzahl Rundensiege"]
["Saison","MA","MN","AH","KS","LM","EN",null,null,"MA","MN","AH","KS","LM","EN","MA","MN","AH","KS","LM","EN","MA","MN","AH","KS","LM","EN","MA","MN","AH","KS","LM","EN","€","MA","MN","AH","KS","LM","EN","MA","MN","AH","KS","LM","EN",null,"MA","MN","AH","KS","LM","EN"]
["10/11",{"$f":"RANK(AO60,$AO60:$AT60)","v":1},{"$f":"RANK(AP60,$AO60:$AT60)","v":2},null,{"$f":"RANK(AR60,$AO60:$AT60)","v":4},null,{"$f":"RANK(AT60,$AO60:$AT60)","v":3},null,"10/11",{"$f":"SUM(J4:J5)","v":27},{"$f":"SUM(K4:K5)","v":27},0,27,0,27,{"$f":"SUM(P4:P5)","v":44.8},32.4,0,24,0,6.8,17.799999999999997,5.3999999999999986,0,-3,0,-20.2,{"$f":"SUM(AB4:AB5)","v":19},11,0,-19,0,-11,{"$f":"SUM(AH4:AH5)/2","v":2.6},{"$f":"SUM(AI4:AI5)","v":49.400000000000006},{"$f":"SUM(AJ4:AJ5)","v":28.6},0,-49.400000000000006,0,-28.6,67.2,34,null,{"$f":"SUM(AR4:AR5)","v":-52.400000000000006},null,{"$f":"SUM(AT4:AT5)","v":-48.8},null,{"$f":"AV4+AV5","v":12},{"$f":"AW4+AW5","v":10},null,2,null,4]
["11/12",{"$f":"RANK(AO61,$AO61:$AT61)","v":1},{"$f":"RANK(AP61,$AO61:$AT61)","v":3},null,{"$f":"RANK(AR61,$AO61:$AT61)","v":2},null,{"$f":"RANK(AT61,$AO61:$AT61)","v":4},null,"11/12",{"$f":"SUM(J6:J7)","v":34},{"$f":"SUM(K6:K7)","v":34},0,34,0,34,{"$f":"SUM(P6:P7)","v":81.599999999999994},13.6,0,20.399999999999999,0,20.399999999999999,47.599999999999994,-20.399999999999999,0,-13.600000000000001,0,-13.600000000000001,{"$f":"SUM(AB6:AB7)","v":1},1,0,5,0,-7,{"$f":"SUM(AH6:AH7)/2","v":2.6500000000000004},{"$f":"SUM(AI6:AI7)","v":3.3000000000000007},{"$f":"SUM(AJ6:AJ7)","v":2.1000000000000014},0,13.700000000000003,0,-19.100000000000001,50.9,-18.299999999999997,null,{"$f":"SUM(AR6:AR7)","v":0.10000000000000142},null,{"$f":"SUM(AT6:AT7)","v":-32.700000000000003},null,{"$f":"AV6+AV7","v":9},{"$f":"AW6+AW7","v":9},null,10,null,7]
["12/13",2,1,null,5,{"$f":"RANK(AS62,$AO62:$AT62)","v":4},3,null,"12/13",{"$f":"SUM(J8:J9)","v":34},{"$f":"SUM(K8:K9)","v":34},0,34,34,34,{"$f":"SUM(P8:P9)","v":76.5},76.5,0,0,8.5,8.5,42.5,42.5,0,-34,-25.5,-25.5,{"$f":"SUM(AB8:AB9)","v":5},30,0,-30,-5,0,{"$f":"SUM(AH8:AH9)/2","v":2.75},{"$f":"SUM(AI8:AI9)","v":12.200000000000003},{"$f":"SUM(AJ8:AJ9)","v":83.199999999999989},0,-82.300000000000011,-13.799999999999999,0.69999999999999574,54.699999999999996,125.69999999999999,null,{"$f":"SUM(AR8:AR9)","v":-116.30000000000001},{"$f":"SUM(AS8:AS9)","v":-39.299999999999997},{"$f":"SUM(AT8:AT9)","v":-24.800000000000008},null,{"$f":"AV8+AV9","v":8},{"$f":"AW8+AW9","v":13},null,1,6,7]
["13/14",1,4,null,3,{"$f":"RANK(AS63,$AO63:$AT63)","v":5},2,null,"13/14",{"$f":"SUM(J10:J12)","v":50},{"$f":"SUM(K10:K12)","v":50},0,50,50,50,{"$f":"SUM(P10:P12)","v":150},8.5,0,33.5,0,58,100,-41.5,0,-16.5,-50,8,{"$f":"SUM(AB10:AB12)","v":6},-4,0,-4,-9,11,{"$f":"SUM(AH10:AH12)/2","v":2.8499999999999996},{"$f":"SUM(AI10:AI12)","v":17.099999999999998},{"$f":"SUM(AJ10:AJ12)","v":-11.399999999999999},0,-11.399999999999999,-25.4,31.099999999999998,117.1,-52.900000000000006,null,{"$f":"SUM(AR10:AR12)","v":-27.9},{"$f":"SUM(AS10:AS12)","v":-75.399999999999991},{"$f":"SUM(AT10:AT12)","v":39.099999999999994},null,{"$f":"AV10+AV11","v":8},{"$f":"AW10+AW11","v":6},null,6,5,9]
["14/15",2,1,null,3,{"$f":"RANK(AS64,$AO64:$AT64)","v":5},4,null,"14/15",{"$f":"SUM(J13:J15)","v":50},{"$f":"SUM(K13:K15)","v":50},0,50,50,50,{"$f":"SUM(P13:P15)","v":75},107.5,0,25.5,0,42,25,57.5,0,-24.5,-50,-8,{"$f":"SUM(AB13:AB15)","v":9},4,0,9,-21,-1,{"$f":"SUM(AH13:AH15)/2","v":2.9},{"$f":"SUM(AI13:AI15)","v":26.099999999999998},{"$f":"SUM(AJ13:AJ15)","v":11.6},0,26.099999999999998,-60.899999999999991,-2.9000000000000004,51.100000000000009,69.099999999999994,null,{"$f":"SUM(AR13:AR15)","v":1.6000000000000014},{"$f":"SUM(AS13:AS15)","v":-110.89999999999999},{"$f":"SUM(AT13:AT15)","v":-10.9},null,{"$f":"AV13+AV14","v":9},{"$f":"AW13+AW14","v":8},null,9,3,7]
["15/16",2,4,null,1,null,3,null,"15/16",{"$f":"SUM(J16:J18)","v":50},{"$f":"SUM(K16:K18)","v":50},0,50,0,50,{"$f":"SUM(P16:P18)","v":80.399999999999991},13.2,0,99.6,0,6.8,30.399999999999995,-36.799999999999997,0,49.599999999999994,0,-43.2,{"$f":"SUM(AB16:AB18)","v":-5},-13,0,15,0,3,{"$f":"SUM(AH16:AH18)/2","v":2.9},{"$f":"SUM(AI16:AI18)","v":-14.499999999999998},{"$f":"SUM(AJ16:AJ18)","v":-37.700000000000003},0,43.5,0,8.6999999999999993,15.899999999999995,-74.499999999999986,null,{"$f":"SUM(AR16:AR18)","v":93.1},null,{"$f":"SUM(AT16:AT18)","v":-34.5},null,{"$f":"AV16+AV17","v":8},{"$f":"AW16+AW17","v":6},null,13,null,10]
["16/17",1,3,null,2,null,4,null,"16/17",{"$f":"SUM(J19:J21)","v":50},{"$f":"SUM(K19:K21)","v":50},0,50,0,50,{"$f":"SUM(P19:P21)","v":86},40.799999999999997,0,60,0,13.2,36,-9.2000000000000028,0,9.9999999999999964,0,-36.799999999999997,{"$f":"SUM(AB19:AB21)","v":13},-3,0,-7,0,-3,{"$f":"SUM(AH19:AH21)/2","v":3},{"$f":"SUM(AI19:AI21)","v":41.300000000000004},{"$f":"SUM(AJ19:AJ21)","v":-9.9000000000000021},0,-22.3,0,-9.1,77.299999999999983,-19.100000000000001,null,{"$f":"SUM(AR19:AR21)","v":-12.300000000000004},null,{"$f":"SUM(AT19:AT21)","v":-45.9},null,{"$f":"AV19+AV20","v":12},{"$f":"AW19+AW20","v":8},null,7,null,8]
["17/18",3,4,null,1,null,2,null,"17/18",{"$f":"SUM(J22:J24)","v":50},{"$f":"SUM(K22:K24)","v":50},0,50,0,50,{"$f":"SUM(P22:P24)","v":47.199999999999996},6.8,0,99.6,0,46.4,-2.8000000000000025,-43.2,0,49.599999999999994,0,-3.6000000000000014,{"$f":"SUM(AB22:AB24)","v":-2},-2,0,-6,0,10,{"$f":"SUM(AH22:AH24)/2","v":3.1},{"$f":"SUM(AI22:AI24)","v":-6.1999999999999993},{"$f":"SUM(AJ22:AJ24)","v":-6.1999999999999993},0,-18.600000000000001,0,31.000000000000004,-8.9999999999999982,-49.400000000000006,null,{"$f":"SUM(AR22:AR24)","v":30.999999999999993},null,{"$f":"SUM(AT22:AT24)","v":27.400000000000002},null,{"$f":"AV22+AV23","v":9},{"$f":"AW22+AW23","v":9},null,8,null,12]
["18/19",2,1,{"$f":"RANK(AQ68,$AO68:$AT68)","v":4},3,null,null,null,"18/19",{"$f":"SUM(J25:J27)","v":50},{"$f":"SUM(K25:K27)","v":50},50,50,0,0,{"$f":"SUM(P25:P27)","v":60},120,6.8,13.2,0,0,9.9999999999999964,70,-43.2,-36.799999999999997,0,0,{"$f":"SUM(AB25:AB27)","v":-9},15,-9,3,0,0,{"$f":"SUM(AH25:AH27)/2","v":3.3},{"$f":"SUM(AI25:AI27)","v":-29.200000000000003},{"$f":"SUM(AJ25:AJ27)","v":50},-30,9.1999999999999993,0,0,-19.200000000000006,120,-73.2,-27.6,null,null,null,{"$f":"AV25+AV26","v":7},{"$f":"AW25+AW26","v":13},7,10]
["19/20",1,2,3,4,null,null,null,"19/20",{"$f":"SUM(J28:J30)","v":50},{"$f":"SUM(K28:K30)","v":50},50,50,0,0,{"$f":"SUM(P28:P30)","v":120},46.4,33.6,0,0,0,70,-3.6000000000000014,-16.399999999999999,-50,0,0,{"$f":"SUM(AB28:AB30)","v":20},8,-12,-16,0,0,{"$f":"SUM(AH28:AH30)/2","v":3.4},{"$f":"SUM(AI28:AI30)","v":68},{"$f":"SUM(AJ28:AJ30)","v":27.2},-40.799999999999997,-54.4,0,0,138,23.599999999999998,-57.199999999999996,-104.39999999999999,null,null,null,{"$f":"AV28+AV29","v":14},{"$f":"AW28+AW29","v":11},6,5]
["20/21",4,3,2,1,null,null,null,"20/21",{"$f":"SUM(J31:J33)","v":50},{"$f":"SUM(K31:K33)","v":50},50,50,0,0,{"$f":"SUM(P31:P33)","v":6.8000000000000007},47.199999999999996,60,86,0,0,-43.2,-2.8000000000000025,9.9999999999999964,36,0,0,{"$f":"SUM(AB31:AB33)","v":-6},-2,6,2,0,0,{"$f":"SUM(AH31:AH33)/2","v":3.4},{"$f":"SUM(AI31:AI33)","v":-20.399999999999999},{"$f":"SUM(AJ31:AJ33)","v":-6.8000000000000007},20.400000000000002,6.8000000000000007,0,0,-63.599999999999994,-9.6,30.4,42.8,null,null,null,{"$f":"AV31+AV32","v":7},{"$f":"AW31+AW32","v":8},10,9]
["21/22",3,1,2,4,null,null,null,"21/22",{"$f":"SUM(J34:J36)","v":50},{"$f":"SUM(K34:K36)","v":50},50,50,0,0,{"$f":"SUM(P34:P36)","v":26.799999999999997},120,39.599999999999994,13.6,0,0,-23.2,70,-10.400000000000002,-36.4,0,0,{"$f":"SUM(AB34:AB36)","v":-7},13,-3,-3,0,0,{"$f":"SUM(AH34:AH36)/2","v":3.7},{"$f":"SUM(AI34:AI36)","v":-24.799999999999997},{"$f":"SUM(AJ34:AJ36)","v":47.2},-10.4,-11.999999999999996,0,0,-48,117.19999999999999,-20.8,-48.4,null,null,null,{"$f":"AV34+AV35","v":7},{"$f":"AW34+AW35","v":12},8,8]
["22/23",3,1,2,4,null,null,null,"22/23",{"$f":"SUM(J37:J39)","v":60},{"$f":"SUM(K37:K39)","v":60},60,60,0,0,{"$f":"SUM(P37:P39)","v":72},144,24,0,0,0,12,84,-36,-60,0,0,{"$f":"SUM(AB37:AB39)","v":-2},2,10,-10,0,0,{"$f":"SUM(AH37:AH39)/2","v":4.0999999999999996},{"$f":"SUM(AI37:AI39)","v":-8.6000000000000014},{"$f":"SUM(AJ37:AJ39)","v":9.8000000000000043},40.200000000000003,-41.400000000000006,0,0,3.3999999999999986,93.800000000000011,4.1999999999999993,-101.4,null,null,null,{"$f":"AV37+AV38","v":9},{"$f":"AW37+AW38","v":10},12,7]
["23/24",2,1,4,3,null,null,null,"23/24",{"$f":"SUM(J40:J42)","v":60},{"$f":"SUM(K40:K42)","v":60},60,60,0,0,{"$f":"SUM(P40:P42)","v":96},120,8,16,0,0,36,60,-52,-44,0,0,{"$f":"SUM(AB40:AB42)","v":-1},11,-13,3,0,0,4.2,{"$f":"SUM(AI40:AI42)","v":-4.1999999999999957},{"$f":"SUM(AJ40:AJ42)","v":46.2},-54.6,12.600000000000001,0,0,31.800000000000011,106.20000000000002,-106.6,-31.4,null,null,null,{"$f":"AV40+AV41","v":9},{"$f":"AW40+AW41","v":12},6,10]
["24/25",{"$f":"RANK(AO74,$AO74:$AT74)","v":2},{"$f":"RANK(AP74,$AO74:$AT74)","v":3},{"$f":"RANK(AQ74,$AO74:$AT74)","v":1},{"$f":"RANK(AR74,$AO74:$AT74)","v":4},null,null,null,"24/25",{"$f":"SUM(J43:J45)","v":50},{"$f":"SUM(K43:K45)","v":50},50,50,0,0,{"$f":"SUM(P43:P45)","v":70},30,90,10,0,0,20,-20,40,-40,0,0,{"$f":"SUM(AB43:AB45)","v":4},4,8,-16,0,0,{"$f":"SUM(AH45:AH47)/2","v":4.5999999999999996},{"$f":"SUM(AI43:AI45)","v":17.600000000000001},{"$f":"SUM(AJ43:AJ45)","v":17.600000000000001},35.200000000000003,-70.400000000000006,0,0,37.6,-2.3999999999999986,75.2,-110.4,null,null,null,{"$f":"AV43+AV44","v":11},{"$f":"AW43+AW44","v":11},12,6]
["25/26",1,1,1,1,null,null,null,"25/26",{"$f":"SUM(J46:J48)","v":50},{"$f":"SUM(K46:K48)","v":50},50,50,0,0,{"$f":"SUM(P46:P48)","v":50},50,50,50,0,0,0,0,0,0,0,0,{"$f":"SUM(AB46:AB48)","v":0},0,0,0,0,0,{"$f":"SUM(AH46:AH48)/2","v":4.5999999999999996},{"$f":"SUM(AI46:AI48)","v":0},{"$f":"SUM(AJ46:AJ48)","v":0},0,0,0,0,0,0,0,0,null,null,null,{"$f":"AV46+AV47","v":0},{"$f":"AW46+AW47","v":0},0,0]
["Gesamt",1,2,4,6,{"$f":"RANK(AS76,$AO76:$AT76)","v":5},3,null,"Gesamt",{"$f":"SUM(J60:J75)","v":765},{"$f":"SUM(K60:K75)","v":765},420,765,134,345,1143.0999999999999,976.9,312,551.40000000000009,8.5,202.1,378.09999999999997,211.89999999999998,-108,-213.6,-125.5,-142.9,45,75,-13,-74,-35,2,null,127.1,251.49999999999997,-39.999999999999986,-250.3,-100.1,11.799999999999994,{"$f":"SUM(AO60:AO75)","v":505.2},463.4,-148,-463.9,-225.59999999999997,-131.10000000000002,null,{"$f":"SUM(AV60:AV75)","v":139},{"$f":"SUM(AW60:AW75)","v":146},61,111,14,64]
[]
["Ränge laut Gesamtgewinn",null,null,null,null,null,null,null,"Saison","Einsatz",null,null,null,null,null,"Auszahlung",null,null,null,null,null,{"$f":"V2","v":"Geldgewinn"},null,null,null,null,null,"Seidl",null,null,null,null,null,"Preis",{"$f":"AI2","v":"Seidl-Gewinn"},null,null,null,null,null,{"$f":"AO2","v":"Gesamtgewinn"},null,null,null,null,null,null,"Anzahl Rundensiege"]
["Bewerb","MA","MN","AH","KS","LM","EN",null,"Bewerb","MA","MN","AH","KS","LM","EN","MA","MN","AH","KS","LM","EN","MA","MN","AH","KS","LM","EN","MA","MN","AH","KS","LM","EN","€","MA","MN","AH","KS","LM","EN","MA","MN","AH","KS","LM","EN",null,"MA","MN","AH","KS","LM","EN"]
["EM2012",{"$f":"RANK(AO80,$AO80:$AT80)","v":4},{"$f":"RANK(AP80,$AO80:$AT80)","v":2},null,{"$f":"RANK(AR80,$AO80:$AT80)","v":2},{"$f":"RANK(AS80,$AO80:$AT80)","v":4},{"$f":"RANK(AT80,$AO80:$AT80)","v":1},null,{"$f":"A80","v":"EM2012"},null,null,null,null,null,null,null,null,null,null,null,null,null,null,null,null,null,null,-4,1,null,1,-4,6,2.6,{"$f":"$AH80*AB80","v":-10.4},2.6,null,{"$f":"$AH80*AE80","v":2.6},{"$f":"$AH80*AF80","v":-10.4},{"$f":"$AH80*AG80","v":15.600000000000001},{"$f":"AI80+V80","v":-10.4},2.6,null,{"$f":"AL80+Y80","v":2.6},{"$f":"AM80+Z80","v":-10.4},{"$f":"AN80+AA80","v":15.600000000000001},null,0,1,null,1,0,2]
["EM2016",2,4,null,1,null,3,null,"EM2016",25,25,null,25,null,25,30,null,null,60,null,10,{"$f":"P81-J81","v":5},-25,null,{"$f":"S81-M81","v":35},null,{"$f":"U81-O81","v":-15},3,3,null,-1,null,-5,2.9,8.6999999999999993,8.6999999999999993,null,{"$f":"$AH81*AE81","v":-2.9},null,{"$f":"$AH81*AG81","v":-14.5},13.7,-16.3,null,{"$f":"AL81+Y81","v":32.1},null,{"$f":"AN81+AA81","v":-29.5},null,2,2,null,1,null,0]
["EM2020",1,2,{"$f":"RANK(AQ82,$AO82:$AT82)","v":4},3,null,null,null,"EM2020",25,25,25,25,null,null,60,30,0,10,null,null,35,5,{"$f":"R82-L82","v":-25},{"$f":"S82-M82","v":-15},null,null,3,3,-5,-1,null,null,3.6,10.8,10.8,{"$f":"$AH82*AD82","v":-18},{"$f":"$AH82*AE82","v":-3.6},null,null,45.8,15.8,{"$f":"AK82+X82","v":-43},{"$f":"AL82+Y82","v":-18.600000000000001},null,null,null,2,2,0,1]
["EM2024",3,1,2,4,null,null,null,"EM2024",25,25,25,25,null,null,10,60,30,0,null,null,{"$f":"P83-J83","v":-15},{"$f":"Q83-K83","v":35},{"$f":"R83-L83","v":5},{"$f":"S83-M83","v":-25},null,null,-2,6,2,-6,null,null,4.2,{"$f":"$AH83*AB83","v":-8.4},{"$f":"$AH83*AC83","v":25.200000000000003},{"$f":"$AH83*AD83","v":8.4},{"$f":"$AH83*AE83","v":-25.200000000000003},null,null,{"$f":"AI83+V83","v":-23.4},{"$f":"AJ83+W83","v":60.2},{"$f":"AK83+X83","v":13.4},{"$f":"AL83+Y83","v":-50.2},null,null,null,1,3,2,0]
["WM2018",{"$f":"RANK(AO84,$AO84:$AT84)","v":2},{"$f":"RANK(AP84,$AO84:$AT84)","v":4},{"$f":"RANK(AQ84,$AO84:$AT84)","v":1},{"$f":"RANK(AR84,$AO84:$AT84)","v":3},null,null,null,{"$f":"A84","v":"WM2018"},25,25,25,25,null,null,30,null,60,10,null,null,{"$f":"P84-J84","v":5},{"$f":"Q84-K84","v":-25},{"$f":"R84-L84","v":35},{"$f":"S84-M84","v":-15},null,null,-1,-5,7,-1,null,null,3.2,{"$f":"$AH84*AB84","v":-3.2},{"$f":"$AH84*AC84","v":-16},{"$f":"$AH84*AD84","v":22.400000000000002},{"$f":"$AH84*AE84","v":-3.2},null,null,{"$f":"AI84+V84","v":1.7999999999999998},{"$f":"AJ84+W84","v":-41},{"$f":"AK84+X84","v":57.400000000000006},{"$f":"AL84+Y84","v":-18.2},null,null,null,1,0,3,1]
["WM2022",3,1,{"$f":"RANK(AQ85,$AO85:$AT85)","v":2},4,null,null,null,"WM2022",25,25,25,25,null,null,30,60,10,0,null,null,5,35,{"$f":"R85-L85","v":-15},{"$f":"S85-M85","v":-25},null,null,-1,-1,7,-5,null,null,4,-4,-4,{"$f":"$AH85*AD85","v":28},{"$f":"$AH85*AE85","v":-20},null,null,1,31,{"$f":"AK85+X85","v":13},{"$f":"AL85+Y85","v":-45},null,null,null,1,1,3,0]
["Bundesliga",1,2,{"$f":"RANK(AQ86,$AO86:$AT86)","v":4},6,5,3,null,"Bundesliga",{"$f":"J76","v":765},765,420,765,134,345,1143.0999999999999,976.9,312,551.40000000000009,8.5,202.1,378.09999999999997,211.89999999999998,-108,-213.6,-125.5,-142.9,45,75,-13,-74,-35,2,null,{"$f":"AI76","v":127.1},251.49999999999997,-39.999999999999986,-250.3,-100.1,11.799999999999994,505.2,463.4,-148,-463.9,-225.59999999999997,-131.10000000000002,null,{"$f":"AV76","v":139},{"$f":"AW76","v":146},61,111,14,64]
["Gesamt",{"$f":"RANK(AO87,$AO87:$AT87)","v":1},2,{"$f":"RANK(AQ87,$AO87:$AT87)","v":3},6,5,4,null,"Gesamt",{"$f":"SUM(J80:J86)","v":890},890,520,890,134,370,1303.0999999999999,1126.9000000000001,412,631.40000000000009,8.5,212.1,413.09999999999997,236.89999999999998,-108,-258.60000000000002,-125.5,-157.9,43,82,-2,-87,-39,3,null,{"$f":"SUM(AI80:AI86)","v":120.6},{"$f":"SUM(AJ80:AJ86)","v":278.79999999999995},0.80000000000001847,-302.60000000000002,-110.5,12.899999999999995,533.69999999999993,515.69999999999993,-107.19999999999999,-561.19999999999993,-235.99999999999997,-145.00000000000003,null,{"$f":"SUM(AV80:AV86)","v":146},{"$f":"SUM(AW80:AW86)","v":155},69,115,14,66]

{"sheet":"Abstände","index":7,"n_rows":66,"n_cols":27,"rows_kept":66,"cut":false,"hidden":false,"merged":[[0,1,0,6],[0,7,0,12],[0,13,0,18]]}
[{"$f":"Parameter!B15","v":"26/27"},"Abstand zum Rundensieger",null,null,null,null,null,"Abstand zum Führenden der Saisonwertung",null,null,null,null,null,"Abstand zum Führenden der Jahreswertung"]
["Runde",{"$f":"Parameter!$C$1","v":"MA"},{"$f":"Parameter!$D$1","v":"MN"},{"$f":"Parameter!$E$1","v":"AH"},{"$f":"Parameter!$F$1","v":"KS"},{"$f":"Parameter!$G$1","v":"LM"},{"$f":"Parameter!$H$1","v":"EN"},{"$f":"Parameter!$C$1","v":"MA"},{"$f":"Parameter!$D$1","v":"MN"},{"$f":"Parameter!$E$1","v":"AH"},{"$f":"Parameter!$F$1","v":"KS"},{"$f":"Parameter!$G$1","v":"LM"},{"$f":"Parameter!$H$1","v":"EN"},{"$f":"Parameter!$C$1","v":"MA"},{"$f":"Parameter!$D$1","v":"MN"},{"$f":"Parameter!$E$1","v":"AH"},{"$f":"Parameter!$F$1","v":"KS"},{"$f":"Parameter!$G$1","v":"LM"},{"$f":"Parameter!$H$1","v":"EN"}]
[1,{"$f":"Übersicht!C48-MAX(Übersicht!$C48:$F48)","v":0},{"$f":"Übersicht!D48-MAX(Übersicht!$C48:$F48)","v":0},{"$f":"Übersicht!E48-MAX(Übersicht!$C48:$F48)","v":0},{"$f":"Übersicht!F48-MAX(Übersicht!$C48:$F48)","v":0},{"$f":"Übersicht!G48-MAX(Übersicht!$C48:$F48)","v":0},{"$f":"Übersicht!H48-MAX(Übersicht!$C48:$F48)","v":0},{"$f":"Übersicht!L4-MAX(Übersicht!$L4:$O4)","v":0},{"$f":"Übersicht!M4-MAX(Übersicht!$L4:$O4)","v":0},{"$f":"Übersicht!N4-MAX(Übersicht!$L4:$O4)","v":0},{"$f":"Übersicht!O4-MAX(Übersicht!$L4:$O4)","v":0},{"$f":"Übersicht!P4-MAX(Übersicht!$L4:$O4)","v":0},{"$f":"Übersicht!Q4-MAX(Übersicht!$L4:$O4)","v":0},{"$f":"Übersicht!L48-MAX(Übersicht!$L48:$O48)","v":0},{"$f":"Übersicht!M48-MAX(Übersicht!$L48:$O48)","v":0},{"$f":"Übersicht!N48-MAX(Übersicht!$L48:$O48)","v":0},{"$f":"Übersicht!O48-MAX(Übersicht!$L48:$O48)","v":0},{"$f":"Übersicht!P48-MAX(Übersicht!$L48:$O48)","v":0},{"$f":"Übersicht!Q48-MAX(Übersicht!$L48:$O48)","v":0}]
[2,{"$f":"Übersicht!C49-MAX(Übersicht!$C49:$F49)","v":0},{"$f":"Übersicht!D49-MAX(Übersicht!$C49:$F49)","v":0},{"$f":"Übersicht!E49-MAX(Übersicht!$C49:$F49)","v":0},{"$f":"Übersicht!F49-MAX(Übersicht!$C49:$F49)","v":0},{"$f":"Übersicht!G49-MAX(Übersicht!$C49:$F49)","v":0},{"$f":"Übersicht!H49-MAX(Übersicht!$C49:$F49)","v":0},{"$f":"Übersicht!L5-MAX(Übersicht!$L5:$O5)","v":0},{"$f":"Übersicht!M5-MAX(Übersicht!$L5:$O5)","v":0},{"$f":"Übersicht!N5-MAX(Übersicht!$L5:$O5)","v":0},{"$f":"Übersicht!O5-MAX(Übersicht!$L5:$O5)","v":0},{"$f":"Übersicht!P5-MAX(Übersicht!$L5:$O5)","v":0},{"$f":"Übersicht!Q5-MAX(Übersicht!$L5:$O5)","v":0},{"$f":"Übersicht!L49-MAX(Übersicht!$L49:$O49)","v":0},{"$f":"Übersicht!M49-MAX(Übersicht!$L49:$O49)","v":0},{"$f":"Übersicht!N49-MAX(Übersicht!$L49:$O49)","v":0},{"$f":"Übersicht!O49-MAX(Übersicht!$L49:$O49)","v":0},{"$f":"Übersicht!P49-MAX(Übersicht!$L49:$O49)","v":0},{"$f":"Übersicht!Q49-MAX(Übersicht!$L49:$O49)","v":0}]
[3,{"$f":"Übersicht!C50-MAX(Übersicht!$C50:$F50)","v":0},{"$f":"Übersicht!D50-MAX(Übersicht!$C50:$F50)","v":0},{"$f":"Übersicht!E50-MAX(Übersicht!$C50:$F50)","v":0},{"$f":"Übersicht!F50-MAX(Übersicht!$C50:$F50)","v":0},{"$f":"Übersicht!G50-MAX(Übersicht!$C50:$F50)","v":0},{"$f":"Übersicht!H50-MAX(Übersicht!$C50:$F50)","v":0},{"$f":"Übersicht!L6-MAX(Übersicht!$L6:$O6)","v":0},{"$f":"Übersicht!M6-MAX(Übersicht!$L6:$O6)","v":0},{"$f":"Übersicht!N6-MAX(Übersicht!$L6:$O6)","v":0},{"$f":"Übersicht!O6-MAX(Übersicht!$L6:$O6)","v":0},{"$f":"Übersicht!P6-MAX(Übersicht!$L6:$O6)","v":0},{"$f":"Übersicht!Q6-MAX(Übersicht!$L6:$O6)","v":0},{"$f":"Übersicht!L50-MAX(Übersicht!$L50:$O50)","v":0},{"$f":"Übersicht!M50-MAX(Übersicht!$L50:$O50)","v":0},{"$f":"Übersicht!N50-MAX(Übersicht!$L50:$O50)","v":0},{"$f":"Übersicht!O50-MAX(Übersicht!$L50:$O50)","v":0},{"$f":"Übersicht!P50-MAX(Übersicht!$L50:$O50)","v":0},{"$f":"Übersicht!Q50-MAX(Übersicht!$L50:$O50)","v":0}]
[4,{"$f":"Übersicht!C51-MAX(Übersicht!$C51:$F51)","v":0},{"$f":"Übersicht!D51-MAX(Übersicht!$C51:$F51)","v":0},{"$f":"Übersicht!E51-MAX(Übersicht!$C51:$F51)","v":0},{"$f":"Übersicht!F51-MAX(Übersicht!$C51:$F51)","v":0},{"$f":"Übersicht!G51-MAX(Übersicht!$C51:$F51)","v":0},{"$f":"Übersicht!H51-MAX(Übersicht!$C51:$F51)","v":0},{"$f":"Übersicht!L7-MAX(Übersicht!$L7:$O7)","v":0},{"$f":"Übersicht!M7-MAX(Übersicht!$L7:$O7)","v":0},{"$f":"Übersicht!N7-MAX(Übersicht!$L7:$O7)","v":0},{"$f":"Übersicht!O7-MAX(Übersicht!$L7:$O7)","v":0},{"$f":"Übersicht!P7-MAX(Übersicht!$L7:$O7)","v":0},{"$f":"Übersicht!Q7-MAX(Übersicht!$L7:$O7)","v":0},{"$f":"Übersicht!L51-MAX(Übersicht!$L51:$O51)","v":0},{"$f":"Übersicht!M51-MAX(Übersicht!$L51:$O51)","v":0},{"$f":"Übersicht!N51-MAX(Übersicht!$L51:$O51)","v":0},{"$f":"Übersicht!O51-MAX(Übersicht!$L51:$O51)","v":0},{"$f":"Übersicht!P51-MAX(Übersicht!$L51:$O51)","v":0},{"$f":"Übersicht!Q51-MAX(Übersicht!$L51:$O51)","v":0}]
[5,{"$f":"Übersicht!C52-MAX(Übersicht!$C52:$F52)","v":0},{"$f":"Übersicht!D52-MAX(Übersicht!$C52:$F52)","v":0},{"$f":"Übersicht!E52-MAX(Übersicht!$C52:$F52)","v":0},{"$f":"Übersicht!F52-MAX(Übersicht!$C52:$F52)","v":0},{"$f":"Übersicht!G52-MAX(Übersicht!$C52:$F52)","v":0},{"$f":"Übersicht!H52-MAX(Übersicht!$C52:$F52)","v":0},{"$f":"Übersicht!L8-MAX(Übersicht!$L8:$O8)","v":0},{"$f":"Übersicht!M8-MAX(Übersicht!$L8:$O8)","v":0},{"$f":"Übersicht!N8-MAX(Übersicht!$L8:$O8)","v":0},{"$f":"Übersicht!O8-MAX(Übersicht!$L8:$O8)","v":0},{"$f":"Übersicht!P8-MAX(Übersicht!$L8:$O8)","v":0},{"$f":"Übersicht!Q8-MAX(Übersicht!$L8:$O8)","v":0},{"$f":"Übersicht!L52-MAX(Übersicht!$L52:$O52)","v":0},{"$f":"Übersicht!M52-MAX(Übersicht!$L52:$O52)","v":0},{"$f":"Übersicht!N52-MAX(Übersicht!$L52:$O52)","v":0},{"$f":"Übersicht!O52-MAX(Übersicht!$L52:$O52)","v":0},{"$f":"Übersicht!P52-MAX(Übersicht!$L52:$O52)","v":0},{"$f":"Übersicht!Q52-MAX(Übersicht!$L52:$O52)","v":0}]
[6,{"$f":"Übersicht!C53-MAX(Übersicht!$C53:$F53)","v":0},{"$f":"Übersicht!D53-MAX(Übersicht!$C53:$F53)","v":0},{"$f":"Übersicht!E53-MAX(Übersicht!$C53:$F53)","v":0},{"$f":"Übersicht!F53-MAX(Übersicht!$C53:$F53)","v":0},{"$f":"Übersicht!G53-MAX(Übersicht!$C53:$F53)","v":0},{"$f":"Übersicht!H53-MAX(Übersicht!$C53:$F53)","v":0},{"$f":"Übersicht!L9-MAX(Übersicht!$L9:$O9)","v":0},{"$f":"Übersicht!M9-MAX(Übersicht!$L9:$O9)","v":0},{"$f":"Übersicht!N9-MAX(Übersicht!$L9:$O9)","v":0},{"$f":"Übersicht!O9-MAX(Übersicht!$L9:$O9)","v":0},{"$f":"Übersicht!P9-MAX(Übersicht!$L9:$O9)","v":0},{"$f":"Übersicht!Q9-MAX(Übersicht!$L9:$O9)","v":0},{"$f":"Übersicht!L53-MAX(Übersicht!$L53:$O53)","v":0},{"$f":"Übersicht!M53-MAX(Übersicht!$L53:$O53)","v":0},{"$f":"Übersicht!N53-MAX(Übersicht!$L53:$O53)","v":0},{"$f":"Übersicht!O53-MAX(Übersicht!$L53:$O53)","v":0},{"$f":"Übersicht!P53-MAX(Übersicht!$L53:$O53)","v":0},{"$f":"Übersicht!Q53-MAX(Übersicht!$L53:$O53)","v":0}]
[7,{"$f":"Übersicht!C54-MAX(Übersicht!$C54:$F54)","v":0},{"$f":"Übersicht!D54-MAX(Übersicht!$C54:$F54)","v":0},{"$f":"Übersicht!E54-MAX(Übersicht!$C54:$F54)","v":0},{"$f":"Übersicht!F54-MAX(Übersicht!$C54:$F54)","v":0},{"$f":"Übersicht!G54-MAX(Übersicht!$C54:$F54)","v":0},{"$f":"Übersicht!H54-MAX(Übersicht!$C54:$F54)","v":0},{"$f":"Übersicht!L10-MAX(Übersicht!$L10:$O10)","v":0},{"$f":"Übersicht!M10-MAX(Übersicht!$L10:$O10)","v":0},{"$f":"Übersicht!N10-MAX(Übersicht!$L10:$O10)","v":0},{"$f":"Übersicht!O10-MAX(Übersicht!$L10:$O10)","v":0},{"$f":"Übersicht!P10-MAX(Übersicht!$L10:$O10)","v":0},{"$f":"Übersicht!Q10-MAX(Übersicht!$L10:$O10)","v":0},{"$f":"Übersicht!L54-MAX(Übersicht!$L54:$O54)","v":0},{"$f":"Übersicht!M54-MAX(Übersicht!$L54:$O54)","v":0},{"$f":"Übersicht!N54-MAX(Übersicht!$L54:$O54)","v":0},{"$f":"Übersicht!O54-MAX(Übersicht!$L54:$O54)","v":0},{"$f":"Übersicht!P54-MAX(Übersicht!$L54:$O54)","v":0},{"$f":"Übersicht!Q54-MAX(Übersicht!$L54:$O54)","v":0}]
[8,{"$f":"Übersicht!C55-MAX(Übersicht!$C55:$F55)","v":0},{"$f":"Übersicht!D55-MAX(Übersicht!$C55:$F55)","v":0},{"$f":"Übersicht!E55-MAX(Übersicht!$C55:$F55)","v":0},{"$f":"Übersicht!F55-MAX(Übersicht!$C55:$F55)","v":0},{"$f":"Übersicht!G55-MAX(Übersicht!$C55:$F55)","v":0},{"$f":"Übersicht!H55-MAX(Übersicht!$C55:$F55)","v":0},{"$f":"Übersicht!L11-MAX(Übersicht!$L11:$O11)","v":0},{"$f":"Übersicht!M11-MAX(Übersicht!$L11:$O11)","v":0},{"$f":"Übersicht!N11-MAX(Übersicht!$L11:$O11)","v":0},{"$f":"Übersicht!O11-MAX(Übersicht!$L11:$O11)","v":0},{"$f":"Übersicht!P11-MAX(Übersicht!$L11:$O11)","v":0},{"$f":"Übersicht!Q11-MAX(Übersicht!$L11:$O11)","v":0},{"$f":"Übersicht!L55-MAX(Übersicht!$L55:$O55)","v":0},{"$f":"Übersicht!M55-MAX(Übersicht!$L55:$O55)","v":0},{"$f":"Übersicht!N55-MAX(Übersicht!$L55:$O55)","v":0},{"$f":"Übersicht!O55-MAX(Übersicht!$L55:$O55)","v":0},{"$f":"Übersicht!P55-MAX(Übersicht!$L55:$O55)","v":0},{"$f":"Übersicht!Q55-MAX(Übersicht!$L55:$O55)","v":0}]
[9,{"$f":"Übersicht!C56-MAX(Übersicht!$C56:$F56)","v":0},{"$f":"Übersicht!D56-MAX(Übersicht!$C56:$F56)","v":0},{"$f":"Übersicht!E56-MAX(Übersicht!$C56:$F56)","v":0},{"$f":"Übersicht!F56-MAX(Übersicht!$C56:$F56)","v":0},{"$f":"Übersicht!G56-MAX(Übersicht!$C56:$F56)","v":0},{"$f":"Übersicht!H56-MAX(Übersicht!$C56:$F56)","v":0},{"$f":"Übersicht!L12-MAX(Übersicht!$L12:$O12)","v":0},{"$f":"Übersicht!M12-MAX(Übersicht!$L12:$O12)","v":0},{"$f":"Übersicht!N12-MAX(Übersicht!$L12:$O12)","v":0},{"$f":"Übersicht!O12-MAX(Übersicht!$L12:$O12)","v":0},{"$f":"Übersicht!P12-MAX(Übersicht!$L12:$O12)","v":0},{"$f":"Übersicht!Q12-MAX(Übersicht!$L12:$O12)","v":0},{"$f":"Übersicht!L56-MAX(Übersicht!$L56:$O56)","v":0},{"$f":"Übersicht!M56-MAX(Übersicht!$L56:$O56)","v":0},{"$f":"Übersicht!N56-MAX(Übersicht!$L56:$O56)","v":0},{"$f":"Übersicht!O56-MAX(Übersicht!$L56:$O56)","v":0},{"$f":"Übersicht!P56-MAX(Übersicht!$L56:$O56)","v":0},{"$f":"Übersicht!Q56-MAX(Übersicht!$L56:$O56)","v":0}]
[10,{"$f":"Übersicht!C57-MAX(Übersicht!$C57:$F57)","v":0},{"$f":"Übersicht!D57-MAX(Übersicht!$C57:$F57)","v":0},{"$f":"Übersicht!E57-MAX(Übersicht!$C57:$F57)","v":0},{"$f":"Übersicht!F57-MAX(Übersicht!$C57:$F57)","v":0},{"$f":"Übersicht!G57-MAX(Übersicht!$C57:$F57)","v":0},{"$f":"Übersicht!H57-MAX(Übersicht!$C57:$F57)","v":0},{"$f":"Übersicht!L13-MAX(Übersicht!$L13:$O13)","v":0},{"$f":"Übersicht!M13-MAX(Übersicht!$L13:$O13)","v":0},{"$f":"Übersicht!N13-MAX(Übersicht!$L13:$O13)","v":0},{"$f":"Übersicht!O13-MAX(Übersicht!$L13:$O13)","v":0},{"$f":"Übersicht!P13-MAX(Übersicht!$L13:$O13)","v":0},{"$f":"Übersicht!Q13-MAX(Übersicht!$L13:$O13)","v":0},{"$f":"Übersicht!L57-MAX(Übersicht!$L57:$O57)","v":0},{"$f":"Übersicht!M57-MAX(Übersicht!$L57:$O57)","v":0},{"$f":"Übersicht!N57-MAX(Übersicht!$L57:$O57)","v":0},{"$f":"Übersicht!O57-MAX(Übersicht!$L57:$O57)","v":0},{"$f":"Übersicht!P57-MAX(Übersicht!$L57:$O57)","v":0},{"$f":"Übersicht!Q57-MAX(Übersicht!$L57:$O57)","v":0}]
[11,{"$f":"Übersicht!C58-MAX(Übersicht!$C58:$F58)","v":0},{"$f":"Übersicht!D58-MAX(Übersicht!$C58:$F58)","v":0},{"$f":"Übersicht!E58-MAX(Übersicht!$C58:$F58)","v":0},{"$f":"Übersicht!F58-MAX(Übersicht!$C58:$F58)","v":0},{"$f":"Übersicht!G58-MAX(Übersicht!$C58:$F58)","v":0},{"$f":"Übersicht!H58-MAX(Übersicht!$C58:$F58)","v":0},{"$f":"Übersicht!L14-MAX(Übersicht!$L14:$O14)","v":0},{"$f":"Übersicht!M14-MAX(Übersicht!$L14:$O14)","v":0},{"$f":"Übersicht!N14-MAX(Übersicht!$L14:$O14)","v":0},{"$f":"Übersicht!O14-MAX(Übersicht!$L14:$O14)","v":0},{"$f":"Übersicht!P14-MAX(Übersicht!$L14:$O14)","v":0},{"$f":"Übersicht!Q14-MAX(Übersicht!$L14:$O14)","v":0},{"$f":"Übersicht!L58-MAX(Übersicht!$L58:$O58)","v":0},{"$f":"Übersicht!M58-MAX(Übersicht!$L58:$O58)","v":0},{"$f":"Übersicht!N58-MAX(Übersicht!$L58:$O58)","v":0},{"$f":"Übersicht!O58-MAX(Übersicht!$L58:$O58)","v":0},{"$f":"Übersicht!P58-MAX(Übersicht!$L58:$O58)","v":0},{"$f":"Übersicht!Q58-MAX(Übersicht!$L58:$O58)","v":0}]
[12,{"$f":"Übersicht!C59-MAX(Übersicht!$C59:$F59)","v":0},{"$f":"Übersicht!D59-MAX(Übersicht!$C59:$F59)","v":0},{"$f":"Übersicht!E59-MAX(Übersicht!$C59:$F59)","v":0},{"$f":"Übersicht!F59-MAX(Übersicht!$C59:$F59)","v":0},{"$f":"Übersicht!G59-MAX(Übersicht!$C59:$F59)","v":0},{"$f":"Übersicht!H59-MAX(Übersicht!$C59:$F59)","v":0},{"$f":"Übersicht!L15-MAX(Übersicht!$L15:$O15)","v":0},{"$f":"Übersicht!M15-MAX(Übersicht!$L15:$O15)","v":0},{"$f":"Übersicht!N15-MAX(Übersicht!$L15:$O15)","v":0},{"$f":"Übersicht!O15-MAX(Übersicht!$L15:$O15)","v":0},{"$f":"Übersicht!P15-MAX(Übersicht!$L15:$O15)","v":0},{"$f":"Übersicht!Q15-MAX(Übersicht!$L15:$O15)","v":0},{"$f":"Übersicht!L59-MAX(Übersicht!$L59:$O59)","v":0},{"$f":"Übersicht!M59-MAX(Übersicht!$L59:$O59)","v":0},{"$f":"Übersicht!N59-MAX(Übersicht!$L59:$O59)","v":0},{"$f":"Übersicht!O59-MAX(Übersicht!$L59:$O59)","v":0},{"$f":"Übersicht!P59-MAX(Übersicht!$L59:$O59)","v":0},{"$f":"Übersicht!Q59-MAX(Übersicht!$L59:$O59)","v":0}]
[13,{"$f":"Übersicht!C60-MAX(Übersicht!$C60:$F60)","v":0},{"$f":"Übersicht!D60-MAX(Übersicht!$C60:$F60)","v":0},{"$f":"Übersicht!E60-MAX(Übersicht!$C60:$F60)","v":0},{"$f":"Übersicht!F60-MAX(Übersicht!$C60:$F60)","v":0},{"$f":"Übersicht!G60-MAX(Übersicht!$C60:$F60)","v":0},{"$f":"Übersicht!H60-MAX(Übersicht!$C60:$F60)","v":0},{"$f":"Übersicht!L16-MAX(Übersicht!$L16:$O16)","v":0},{"$f":"Übersicht!M16-MAX(Übersicht!$L16:$O16)","v":0},{"$f":"Übersicht!N16-MAX(Übersicht!$L16:$O16)","v":0},{"$f":"Übersicht!O16-MAX(Übersicht!$L16:$O16)","v":0},{"$f":"Übersicht!P16-MAX(Übersicht!$L16:$O16)","v":0},{"$f":"Übersicht!Q16-MAX(Übersicht!$L16:$O16)","v":0},{"$f":"Übersicht!L60-MAX(Übersicht!$L60:$O60)","v":0},{"$f":"Übersicht!M60-MAX(Übersicht!$L60:$O60)","v":0},{"$f":"Übersicht!N60-MAX(Übersicht!$L60:$O60)","v":0},{"$f":"Übersicht!O60-MAX(Übersicht!$L60:$O60)","v":0},{"$f":"Übersicht!P60-MAX(Übersicht!$L60:$O60)","v":0},{"$f":"Übersicht!Q60-MAX(Übersicht!$L60:$O60)","v":0}]
[14,{"$f":"Übersicht!C61-MAX(Übersicht!$C61:$F61)","v":0},{"$f":"Übersicht!D61-MAX(Übersicht!$C61:$F61)","v":0},{"$f":"Übersicht!E61-MAX(Übersicht!$C61:$F61)","v":0},{"$f":"Übersicht!F61-MAX(Übersicht!$C61:$F61)","v":0},{"$f":"Übersicht!G61-MAX(Übersicht!$C61:$F61)","v":0},{"$f":"Übersicht!H61-MAX(Übersicht!$C61:$F61)","v":0},{"$f":"Übersicht!L17-MAX(Übersicht!$L17:$O17)","v":0},{"$f":"Übersicht!M17-MAX(Übersicht!$L17:$O17)","v":0},{"$f":"Übersicht!N17-MAX(Übersicht!$L17:$O17)","v":0},{"$f":"Übersicht!O17-MAX(Übersicht!$L17:$O17)","v":0},{"$f":"Übersicht!P17-MAX(Übersicht!$L17:$O17)","v":0},{"$f":"Übersicht!Q17-MAX(Übersicht!$L17:$O17)","v":0},{"$f":"Übersicht!L61-MAX(Übersicht!$L61:$O61)","v":0},{"$f":"Übersicht!M61-MAX(Übersicht!$L61:$O61)","v":0},{"$f":"Übersicht!N61-MAX(Übersicht!$L61:$O61)","v":0},{"$f":"Übersicht!O61-MAX(Übersicht!$L61:$O61)","v":0},{"$f":"Übersicht!P61-MAX(Übersicht!$L61:$O61)","v":0},{"$f":"Übersicht!Q61-MAX(Übersicht!$L61:$O61)","v":0}]
[15,{"$f":"Übersicht!C62-MAX(Übersicht!$C62:$F62)","v":0},{"$f":"Übersicht!D62-MAX(Übersicht!$C62:$F62)","v":0},{"$f":"Übersicht!E62-MAX(Übersicht!$C62:$F62)","v":0},{"$f":"Übersicht!F62-MAX(Übersicht!$C62:$F62)","v":0},{"$f":"Übersicht!G62-MAX(Übersicht!$C62:$F62)","v":0},{"$f":"Übersicht!H62-MAX(Übersicht!$C62:$F62)","v":0},{"$f":"Übersicht!L18-MAX(Übersicht!$L18:$O18)","v":0},{"$f":"Übersicht!M18-MAX(Übersicht!$L18:$O18)","v":0},{"$f":"Übersicht!N18-MAX(Übersicht!$L18:$O18)","v":0},{"$f":"Übersicht!O18-MAX(Übersicht!$L18:$O18)","v":0},{"$f":"Übersicht!P18-MAX(Übersicht!$L18:$O18)","v":0},{"$f":"Übersicht!Q18-MAX(Übersicht!$L18:$O18)","v":0},{"$f":"Übersicht!L62-MAX(Übersicht!$L62:$O62)","v":0},{"$f":"Übersicht!M62-MAX(Übersicht!$L62:$O62)","v":0},{"$f":"Übersicht!N62-MAX(Übersicht!$L62:$O62)","v":0},{"$f":"Übersicht!O62-MAX(Übersicht!$L62:$O62)","v":0},{"$f":"Übersicht!P62-MAX(Übersicht!$L62:$O62)","v":0},{"$f":"Übersicht!Q62-MAX(Übersicht!$L62:$O62)","v":0}]
[16,{"$f":"Übersicht!C63-MAX(Übersicht!$C63:$F63)","v":0},{"$f":"Übersicht!D63-MAX(Übersicht!$C63:$F63)","v":0},{"$f":"Übersicht!E63-MAX(Übersicht!$C63:$F63)","v":0},{"$f":"Übersicht!F63-MAX(Übersicht!$C63:$F63)","v":0},{"$f":"Übersicht!G63-MAX(Übersicht!$C63:$F63)","v":0},{"$f":"Übersicht!H63-MAX(Übersicht!$C63:$F63)","v":0},{"$f":"Übersicht!L19-MAX(Übersicht!$L19:$O19)","v":0},{"$f":"Übersicht!M19-MAX(Übersicht!$L19:$O19)","v":0},{"$f":"Übersicht!N19-MAX(Übersicht!$L19:$O19)","v":0},{"$f":"Übersicht!O19-MAX(Übersicht!$L19:$O19)","v":0},{"$f":"Übersicht!P19-MAX(Übersicht!$L19:$O19)","v":0},{"$f":"Übersicht!Q19-MAX(Übersicht!$L19:$O19)","v":0},{"$f":"Übersicht!L63-MAX(Übersicht!$L63:$O63)","v":0},{"$f":"Übersicht!M63-MAX(Übersicht!$L63:$O63)","v":0},{"$f":"Übersicht!N63-MAX(Übersicht!$L63:$O63)","v":0},{"$f":"Übersicht!O63-MAX(Übersicht!$L63:$O63)","v":0},{"$f":"Übersicht!P63-MAX(Übersicht!$L63:$O63)","v":0},{"$f":"Übersicht!Q63-MAX(Übersicht!$L63:$O63)","v":0}]
[17,{"$f":"Übersicht!C64-MAX(Übersicht!$C64:$F64)","v":0},{"$f":"Übersicht!D64-MAX(Übersicht!$C64:$F64)","v":0},{"$f":"Übersicht!E64-MAX(Übersicht!$C64:$F64)","v":0},{"$f":"Übersicht!F64-MAX(Übersicht!$C64:$F64)","v":0},{"$f":"Übersicht!G64-MAX(Übersicht!$C64:$F64)","v":0},{"$f":"Übersicht!H64-MAX(Übersicht!$C64:$F64)","v":0},{"$f":"Übersicht!L20-MAX(Übersicht!$L20:$O20)","v":0},{"$f":"Übersicht!M20-MAX(Übersicht!$L20:$O20)","v":0},{"$f":"Übersicht!N20-MAX(Übersicht!$L20:$O20)","v":0},{"$f":"Übersicht!O20-MAX(Übersicht!$L20:$O20)","v":0},{"$f":"Übersicht!P20-MAX(Übersicht!$L20:$O20)","v":0},{"$f":"Übersicht!Q20-MAX(Übersicht!$L20:$O20)","v":0},{"$f":"Übersicht!L64-MAX(Übersicht!$L64:$O64)","v":0},{"$f":"Übersicht!M64-MAX(Übersicht!$L64:$O64)","v":0},{"$f":"Übersicht!N64-MAX(Übersicht!$L64:$O64)","v":0},{"$f":"Übersicht!O64-MAX(Übersicht!$L64:$O64)","v":0},{"$f":"Übersicht!P64-MAX(Übersicht!$L64:$O64)","v":0},{"$f":"Übersicht!Q64-MAX(Übersicht!$L64:$O64)","v":0}]
[18,{"$f":"Übersicht!C65-MAX(Übersicht!$C65:$F65)","v":0},{"$f":"Übersicht!D65-MAX(Übersicht!$C65:$F65)","v":0},{"$f":"Übersicht!E65-MAX(Übersicht!$C65:$F65)","v":0},{"$f":"Übersicht!F65-MAX(Übersicht!$C65:$F65)","v":0},{"$f":"Übersicht!G65-MAX(Übersicht!$C65:$F65)","v":0},{"$f":"Übersicht!H65-MAX(Übersicht!$C65:$F65)","v":0},{"$f":"Übersicht!L26-MAX(Übersicht!$L26:$O26)","v":0},{"$f":"Übersicht!M26-MAX(Übersicht!$L26:$O26)","v":0},{"$f":"Übersicht!N26-MAX(Übersicht!$L26:$O26)","v":0},{"$f":"Übersicht!O26-MAX(Übersicht!$L26:$O26)","v":0},{"$f":"Übersicht!P26-MAX(Übersicht!$L26:$O26)","v":0},{"$f":"Übersicht!Q26-MAX(Übersicht!$L26:$O26)","v":0},{"$f":"Übersicht!L65-MAX(Übersicht!$L65:$O65)","v":0},{"$f":"Übersicht!M65-MAX(Übersicht!$L65:$O65)","v":0},{"$f":"Übersicht!N65-MAX(Übersicht!$L65:$O65)","v":0},{"$f":"Übersicht!O65-MAX(Übersicht!$L65:$O65)","v":0},{"$f":"Übersicht!P65-MAX(Übersicht!$L65:$O65)","v":0},{"$f":"Übersicht!Q65-MAX(Übersicht!$L65:$O65)","v":0}]
[19,{"$f":"Übersicht!C66-MAX(Übersicht!$C66:$F66)","v":0},{"$f":"Übersicht!D66-MAX(Übersicht!$C66:$F66)","v":0},{"$f":"Übersicht!E66-MAX(Übersicht!$C66:$F66)","v":0},{"$f":"Übersicht!F66-MAX(Übersicht!$C66:$F66)","v":0},{"$f":"Übersicht!G66-MAX(Übersicht!$C66:$F66)","v":0},{"$f":"Übersicht!H66-MAX(Übersicht!$C66:$F66)","v":0},{"$f":"Übersicht!L27-MAX(Übersicht!$L27:$O27)","v":0},{"$f":"Übersicht!M27-MAX(Übersicht!$L27:$O27)","v":0},{"$f":"Übersicht!N27-MAX(Übersicht!$L27:$O27)","v":0},{"$f":"Übersicht!O27-MAX(Übersicht!$L27:$O27)","v":0},{"$f":"Übersicht!P27-MAX(Übersicht!$L27:$O27)","v":0},{"$f":"Übersicht!Q27-MAX(Übersicht!$L27:$O27)","v":0},{"$f":"Übersicht!L66-MAX(Übersicht!$L66:$O66)","v":0},{"$f":"Übersicht!M66-MAX(Übersicht!$L66:$O66)","v":0},{"$f":"Übersicht!N66-MAX(Übersicht!$L66:$O66)","v":0},{"$f":"Übersicht!O66-MAX(Übersicht!$L66:$O66)","v":0},{"$f":"Übersicht!P66-MAX(Übersicht!$L66:$O66)","v":0},{"$f":"Übersicht!Q66-MAX(Übersicht!$L66:$O66)","v":0}]
[20,{"$f":"Übersicht!C67-MAX(Übersicht!$C67:$F67)","v":0},{"$f":"Übersicht!D67-MAX(Übersicht!$C67:$F67)","v":0},{"$f":"Übersicht!E67-MAX(Übersicht!$C67:$F67)","v":0},{"$f":"Übersicht!F67-MAX(Übersicht!$C67:$F67)","v":0},{"$f":"Übersicht!G67-MAX(Übersicht!$C67:$F67)","v":0},{"$f":"Übersicht!H67-MAX(Übersicht!$C67:$F67)","v":0},{"$f":"Übersicht!L28-MAX(Übersicht!$L28:$O28)","v":0},{"$f":"Übersicht!M28-MAX(Übersicht!$L28:$O28)","v":0},{"$f":"Übersicht!N28-MAX(Übersicht!$L28:$O28)","v":0},{"$f":"Übersicht!O28-MAX(Übersicht!$L28:$O28)","v":0},{"$f":"Übersicht!P28-MAX(Übersicht!$L28:$O28)","v":0},{"$f":"Übersicht!Q28-MAX(Übersicht!$L28:$O28)","v":0},{"$f":"Übersicht!L67-MAX(Übersicht!$L67:$O67)","v":0},{"$f":"Übersicht!M67-MAX(Übersicht!$L67:$O67)","v":0},{"$f":"Übersicht!N67-MAX(Übersicht!$L67:$O67)","v":0},{"$f":"Übersicht!O67-MAX(Übersicht!$L67:$O67)","v":0},{"$f":"Übersicht!P67-MAX(Übersicht!$L67:$O67)","v":0},{"$f":"Übersicht!Q67-MAX(Übersicht!$L67:$O67)","v":0}]
[21,{"$f":"Übersicht!C68-MAX(Übersicht!$C68:$F68)","v":0},{"$f":"Übersicht!D68-MAX(Übersicht!$C68:$F68)","v":0},{"$f":"Übersicht!E68-MAX(Übersicht!$C68:$F68)","v":0},{"$f":"Übersicht!F68-MAX(Übersicht!$C68:$F68)","v":0},{"$f":"Übersicht!G68-MAX(Übersicht!$C68:$F68)","v":0},{"$f":"Übersicht!H68-MAX(Übersicht!$C68:$F68)","v":0},{"$f":"Übersicht!L29-MAX(Übersicht!$L29:$O29)","v":0},{"$f":"Übersicht!M29-MAX(Übersicht!$L29:$O29)","v":0},{"$f":"Übersicht!N29-MAX(Übersicht!$L29:$O29)","v":0},{"$f":"Übersicht!O29-MAX(Übersicht!$L29:$O29)","v":0},{"$f":"Übersicht!P29-MAX(Übersicht!$L29:$O29)","v":0},{"$f":"Übersicht!Q29-MAX(Übersicht!$L29:$O29)","v":0},{"$f":"Übersicht!L68-MAX(Übersicht!$L68:$O68)","v":0},{"$f":"Übersicht!M68-MAX(Übersicht!$L68:$O68)","v":0},{"$f":"Übersicht!N68-MAX(Übersicht!$L68:$O68)","v":0},{"$f":"Übersicht!O68-MAX(Übersicht!$L68:$O68)","v":0},{"$f":"Übersicht!P68-MAX(Übersicht!$L68:$O68)","v":0},{"$f":"Übersicht!Q68-MAX(Übersicht!$L68:$O68)","v":0}]
[22,{"$f":"Übersicht!C69-MAX(Übersicht!$C69:$F69)","v":0},{"$f":"Übersicht!D69-MAX(Übersicht!$C69:$F69)","v":0},{"$f":"Übersicht!E69-MAX(Übersicht!$C69:$F69)","v":0},{"$f":"Übersicht!F69-MAX(Übersicht!$C69:$F69)","v":0},{"$f":"Übersicht!G69-MAX(Übersicht!$C69:$F69)","v":0},{"$f":"Übersicht!H69-MAX(Übersicht!$C69:$F69)","v":0},{"$f":"Übersicht!L30-MAX(Übersicht!$L30:$O30)","v":0},{"$f":"Übersicht!M30-MAX(Übersicht!$L30:$O30)","v":0},{"$f":"Übersicht!N30-MAX(Übersicht!$L30:$O30)","v":0},{"$f":"Übersicht!O30-MAX(Übersicht!$L30:$O30)","v":0},{"$f":"Übersicht!P30-MAX(Übersicht!$L30:$O30)","v":0},{"$f":"Übersicht!Q30-MAX(Übersicht!$L30:$O30)","v":0},{"$f":"Übersicht!L69-MAX(Übersicht!$L69:$O69)","v":0},{"$f":"Übersicht!M69-MAX(Übersicht!$L69:$O69)","v":0},{"$f":"Übersicht!N69-MAX(Übersicht!$L69:$O69)","v":0},{"$f":"Übersicht!O69-MAX(Übersicht!$L69:$O69)","v":0},{"$f":"Übersicht!P69-MAX(Übersicht!$L69:$O69)","v":0},{"$f":"Übersicht!Q69-MAX(Übersicht!$L69:$O69)","v":0}]
[23,{"$f":"Übersicht!C70-MAX(Übersicht!$C70:$F70)","v":0},{"$f":"Übersicht!D70-MAX(Übersicht!$C70:$F70)","v":0},{"$f":"Übersicht!E70-MAX(Übersicht!$C70:$F70)","v":0},{"$f":"Übersicht!F70-MAX(Übersicht!$C70:$F70)","v":0},{"$f":"Übersicht!G70-MAX(Übersicht!$C70:$F70)","v":0},{"$f":"Übersicht!H70-MAX(Übersicht!$C70:$F70)","v":0},{"$f":"Übersicht!L31-MAX(Übersicht!$L31:$O31)","v":0},{"$f":"Übersicht!M31-MAX(Übersicht!$L31:$O31)","v":0},{"$f":"Übersicht!N31-MAX(Übersicht!$L31:$O31)","v":0},{"$f":"Übersicht!O31-MAX(Übersicht!$L31:$O31)","v":0},{"$f":"Übersicht!P31-MAX(Übersicht!$L31:$O31)","v":0},{"$f":"Übersicht!Q31-MAX(Übersicht!$L31:$O31)","v":0},{"$f":"Übersicht!L70-MAX(Übersicht!$L70:$O70)","v":0},{"$f":"Übersicht!M70-MAX(Übersicht!$L70:$O70)","v":0},{"$f":"Übersicht!N70-MAX(Übersicht!$L70:$O70)","v":0},{"$f":"Übersicht!O70-MAX(Übersicht!$L70:$O70)","v":0},{"$f":"Übersicht!P70-MAX(Übersicht!$L70:$O70)","v":0},{"$f":"Übersicht!Q70-MAX(Übersicht!$L70:$O70)","v":0}]
[24,{"$f":"Übersicht!C71-MAX(Übersicht!$C71:$F71)","v":0},{"$f":"Übersicht!D71-MAX(Übersicht!$C71:$F71)","v":0},{"$f":"Übersicht!E71-MAX(Übersicht!$C71:$F71)","v":0},{"$f":"Übersicht!F71-MAX(Übersicht!$C71:$F71)","v":0},{"$f":"Übersicht!G71-MAX(Übersicht!$C71:$F71)","v":0},{"$f":"Übersicht!H71-MAX(Übersicht!$C71:$F71)","v":0},{"$f":"Übersicht!L32-MAX(Übersicht!$L32:$O32)","v":0},{"$f":"Übersicht!M32-MAX(Übersicht!$L32:$O32)","v":0},{"$f":"Übersicht!N32-MAX(Übersicht!$L32:$O32)","v":0},{"$f":"Übersicht!O32-MAX(Übersicht!$L32:$O32)","v":0},{"$f":"Übersicht!P32-MAX(Übersicht!$L32:$O32)","v":0},{"$f":"Übersicht!Q32-MAX(Übersicht!$L32:$O32)","v":0},{"$f":"Übersicht!L71-MAX(Übersicht!$L71:$O71)","v":0},{"$f":"Übersicht!M71-MAX(Übersicht!$L71:$O71)","v":0},{"$f":"Übersicht!N71-MAX(Übersicht!$L71:$O71)","v":0},{"$f":"Übersicht!O71-MAX(Übersicht!$L71:$O71)","v":0},{"$f":"Übersicht!P71-MAX(Übersicht!$L71:$O71)","v":0},{"$f":"Übersicht!Q71-MAX(Übersicht!$L71:$O71)","v":0}]
[25,{"$f":"Übersicht!C72-MAX(Übersicht!$C72:$F72)","v":0},{"$f":"Übersicht!D72-MAX(Übersicht!$C72:$F72)","v":0},{"$f":"Übersicht!E72-MAX(Übersicht!$C72:$F72)","v":0},{"$f":"Übersicht!F72-MAX(Übersicht!$C72:$F72)","v":0},{"$f":"Übersicht!G72-MAX(Übersicht!$C72:$F72)","v":0},{"$f":"Übersicht!H72-MAX(Übersicht!$C72:$F72)","v":0},{"$f":"Übersicht!L33-MAX(Übersicht!$L33:$O33)","v":0},{"$f":"Übersicht!M33-MAX(Übersicht!$L33:$O33)","v":0},{"$f":"Übersicht!N33-MAX(Übersicht!$L33:$O33)","v":0},{"$f":"Übersicht!O33-MAX(Übersicht!$L33:$O33)","v":0},{"$f":"Übersicht!P33-MAX(Übersicht!$L33:$O33)","v":0},{"$f":"Übersicht!Q33-MAX(Übersicht!$L33:$O33)","v":0},{"$f":"Übersicht!L72-MAX(Übersicht!$L72:$O72)","v":0},{"$f":"Übersicht!M72-MAX(Übersicht!$L72:$O72)","v":0},{"$f":"Übersicht!N72-MAX(Übersicht!$L72:$O72)","v":0},{"$f":"Übersicht!O72-MAX(Übersicht!$L72:$O72)","v":0},{"$f":"Übersicht!P72-MAX(Übersicht!$L72:$O72)","v":0},{"$f":"Übersicht!Q72-MAX(Übersicht!$L72:$O72)","v":0}]
[26,{"$f":"Übersicht!C73-MAX(Übersicht!$C73:$F73)","v":0},{"$f":"Übersicht!D73-MAX(Übersicht!$C73:$F73)","v":0},{"$f":"Übersicht!E73-MAX(Übersicht!$C73:$F73)","v":0},{"$f":"Übersicht!F73-MAX(Übersicht!$C73:$F73)","v":0},{"$f":"Übersicht!G73-MAX(Übersicht!$C73:$F73)","v":0},{"$f":"Übersicht!H73-MAX(Übersicht!$C73:$F73)","v":0},{"$f":"Übersicht!L34-MAX(Übersicht!$L34:$O34)","v":0},{"$f":"Übersicht!M34-MAX(Übersicht!$L34:$O34)","v":0},{"$f":"Übersicht!N34-MAX(Übersicht!$L34:$O34)","v":0},{"$f":"Übersicht!O34-MAX(Übersicht!$L34:$O34)","v":0},{"$f":"Übersicht!P34-MAX(Übersicht!$L34:$O34)","v":0},{"$f":"Übersicht!Q34-MAX(Übersicht!$L34:$O34)","v":0},{"$f":"Übersicht!L73-MAX(Übersicht!$L73:$O73)","v":0},{"$f":"Übersicht!M73-MAX(Übersicht!$L73:$O73)","v":0},{"$f":"Übersicht!N73-MAX(Übersicht!$L73:$O73)","v":0},{"$f":"Übersicht!O73-MAX(Übersicht!$L73:$O73)","v":0},{"$f":"Übersicht!P73-MAX(Übersicht!$L73:$O73)","v":0},{"$f":"Übersicht!Q73-MAX(Übersicht!$L73:$O73)","v":0}]
[27,{"$f":"Übersicht!C74-MAX(Übersicht!$C74:$F74)","v":0},{"$f":"Übersicht!D74-MAX(Übersicht!$C74:$F74)","v":0},{"$f":"Übersicht!E74-MAX(Übersicht!$C74:$F74)","v":0},{"$f":"Übersicht!F74-MAX(Übersicht!$C74:$F74)","v":0},{"$f":"Übersicht!G74-MAX(Übersicht!$C74:$F74)","v":0},{"$f":"Übersicht!H74-MAX(Übersicht!$C74:$F74)","v":0},{"$f":"Übersicht!L35-MAX(Übersicht!$L35:$O35)","v":0},{"$f":"Übersicht!M35-MAX(Übersicht!$L35:$O35)","v":0},{"$f":"Übersicht!N35-MAX(Übersicht!$L35:$O35)","v":0},{"$f":"Übersicht!O35-MAX(Übersicht!$L35:$O35)","v":0},{"$f":"Übersicht!P35-MAX(Übersicht!$L35:$O35)","v":0},{"$f":"Übersicht!Q35-MAX(Übersicht!$L35:$O35)","v":0},{"$f":"Übersicht!L74-MAX(Übersicht!$L74:$O74)","v":0},{"$f":"Übersicht!M74-MAX(Übersicht!$L74:$O74)","v":0},{"$f":"Übersicht!N74-MAX(Übersicht!$L74:$O74)","v":0},{"$f":"Übersicht!O74-MAX(Übersicht!$L74:$O74)","v":0},{"$f":"Übersicht!P74-MAX(Übersicht!$L74:$O74)","v":0},{"$f":"Übersicht!Q74-MAX(Übersicht!$L74:$O74)","v":0}]
[28,{"$f":"Übersicht!C75-MAX(Übersicht!$C75:$F75)","v":0},{"$f":"Übersicht!D75-MAX(Übersicht!$C75:$F75)","v":0},{"$f":"Übersicht!E75-MAX(Übersicht!$C75:$F75)","v":0},{"$f":"Übersicht!F75-MAX(Übersicht!$C75:$F75)","v":0},{"$f":"Übersicht!G75-MAX(Übersicht!$C75:$F75)","v":0},{"$f":"Übersicht!H75-MAX(Übersicht!$C75:$F75)","v":0},{"$f":"Übersicht!L36-MAX(Übersicht!$L36:$O36)","v":0},{"$f":"Übersicht!M36-MAX(Übersicht!$L36:$O36)","v":0},{"$f":"Übersicht!N36-MAX(Übersicht!$L36:$O36)","v":0},{"$f":"Übersicht!O36-MAX(Übersicht!$L36:$O36)","v":0},{"$f":"Übersicht!P36-MAX(Übersicht!$L36:$O36)","v":0},{"$f":"Übersicht!Q36-MAX(Übersicht!$L36:$O36)","v":0},{"$f":"Übersicht!L75-MAX(Übersicht!$L75:$O75)","v":0},{"$f":"Übersicht!M75-MAX(Übersicht!$L75:$O75)","v":0},{"$f":"Übersicht!N75-MAX(Übersicht!$L75:$O75)","v":0},{"$f":"Übersicht!O75-MAX(Übersicht!$L75:$O75)","v":0},{"$f":"Übersicht!P75-MAX(Übersicht!$L75:$O75)","v":0},{"$f":"Übersicht!Q75-MAX(Übersicht!$L75:$O75)","v":0}]
[29,{"$f":"Übersicht!C76-MAX(Übersicht!$C76:$F76)","v":0},{"$f":"Übersicht!D76-MAX(Übersicht!$C76:$F76)","v":0},{"$f":"Übersicht!E76-MAX(Übersicht!$C76:$F76)","v":0},{"$f":"Übersicht!F76-MAX(Übersicht!$C76:$F76)","v":0},{"$f":"Übersicht!G76-MAX(Übersicht!$C76:$F76)","v":0},{"$f":"Übersicht!H76-MAX(Übersicht!$C76:$F76)","v":0},{"$f":"Übersicht!L37-MAX(Übersicht!$L37:$O37)","v":0},{"$f":"Übersicht!M37-MAX(Übersicht!$L37:$O37)","v":0},{"$f":"Übersicht!N37-MAX(Übersicht!$L37:$O37)","v":0},{"$f":"Übersicht!O37-MAX(Übersicht!$L37:$O37)","v":0},{"$f":"Übersicht!P37-MAX(Übersicht!$L37:$O37)","v":0},{"$f":"Übersicht!Q37-MAX(Übersicht!$L37:$O37)","v":0},{"$f":"Übersicht!L76-MAX(Übersicht!$L76:$O76)","v":0},{"$f":"Übersicht!M76-MAX(Übersicht!$L76:$O76)","v":0},{"$f":"Übersicht!N76-MAX(Übersicht!$L76:$O76)","v":0},{"$f":"Übersicht!O76-MAX(Übersicht!$L76:$O76)","v":0},{"$f":"Übersicht!P76-MAX(Übersicht!$L76:$O76)","v":0},{"$f":"Übersicht!Q76-MAX(Übersicht!$L76:$O76)","v":0}]
[30,{"$f":"Übersicht!C77-MAX(Übersicht!$C77:$F77)","v":0},{"$f":"Übersicht!D77-MAX(Übersicht!$C77:$F77)","v":0},{"$f":"Übersicht!E77-MAX(Übersicht!$C77:$F77)","v":0},{"$f":"Übersicht!F77-MAX(Übersicht!$C77:$F77)","v":0},{"$f":"Übersicht!G77-MAX(Übersicht!$C77:$F77)","v":0},{"$f":"Übersicht!H77-MAX(Übersicht!$C77:$F77)","v":0},{"$f":"Übersicht!L38-MAX(Übersicht!$L38:$O38)","v":0},{"$f":"Übersicht!M38-MAX(Übersicht!$L38:$O38)","v":0},{"$f":"Übersicht!N38-MAX(Übersicht!$L38:$O38)","v":0},{"$f":"Übersicht!O38-MAX(Übersicht!$L38:$O38)","v":0},{"$f":"Übersicht!P38-MAX(Übersicht!$L38:$O38)","v":0},{"$f":"Übersicht!Q38-MAX(Übersicht!$L38:$O38)","v":0},{"$f":"Übersicht!L77-MAX(Übersicht!$L77:$O77)","v":0},{"$f":"Übersicht!M77-MAX(Übersicht!$L77:$O77)","v":0},{"$f":"Übersicht!N77-MAX(Übersicht!$L77:$O77)","v":0},{"$f":"Übersicht!O77-MAX(Übersicht!$L77:$O77)","v":0},{"$f":"Übersicht!P77-MAX(Übersicht!$L77:$O77)","v":0},{"$f":"Übersicht!Q77-MAX(Übersicht!$L77:$O77)","v":0}]
[31,{"$f":"Übersicht!C78-MAX(Übersicht!$C78:$F78)","v":0},{"$f":"Übersicht!D78-MAX(Übersicht!$C78:$F78)","v":0},{"$f":"Übersicht!E78-MAX(Übersicht!$C78:$F78)","v":0},{"$f":"Übersicht!F78-MAX(Übersicht!$C78:$F78)","v":0},{"$f":"Übersicht!G78-MAX(Übersicht!$C78:$F78)","v":0},{"$f":"Übersicht!H78-MAX(Übersicht!$C78:$F78)","v":0},{"$f":"Übersicht!L39-MAX(Übersicht!$L39:$O39)","v":0},{"$f":"Übersicht!M39-MAX(Übersicht!$L39:$O39)","v":0},{"$f":"Übersicht!N39-MAX(Übersicht!$L39:$O39)","v":0},{"$f":"Übersicht!O39-MAX(Übersicht!$L39:$O39)","v":0},{"$f":"Übersicht!P39-MAX(Übersicht!$L39:$O39)","v":0},{"$f":"Übersicht!Q39-MAX(Übersicht!$L39:$O39)","v":0},{"$f":"Übersicht!L78-MAX(Übersicht!$L78:$O78)","v":0},{"$f":"Übersicht!M78-MAX(Übersicht!$L78:$O78)","v":0},{"$f":"Übersicht!N78-MAX(Übersicht!$L78:$O78)","v":0},{"$f":"Übersicht!O78-MAX(Übersicht!$L78:$O78)","v":0},{"$f":"Übersicht!P78-MAX(Übersicht!$L78:$O78)","v":0},{"$f":"Übersicht!Q78-MAX(Übersicht!$L78:$O78)","v":0}]
[32,{"$f":"Übersicht!C79-MAX(Übersicht!$C79:$F79)","v":0},{"$f":"Übersicht!D79-MAX(Übersicht!$C79:$F79)","v":0},{"$f":"Übersicht!E79-MAX(Übersicht!$C79:$F79)","v":0},{"$f":"Übersicht!F79-MAX(Übersicht!$C79:$F79)","v":0},{"$f":"Übersicht!G79-MAX(Übersicht!$C79:$F79)","v":0},{"$f":"Übersicht!H79-MAX(Übersicht!$C79:$F79)","v":0},{"$f":"Übersicht!L40-MAX(Übersicht!$L40:$O40)","v":0},{"$f":"Übersicht!M40-MAX(Übersicht!$L40:$O40)","v":0},{"$f":"Übersicht!N40-MAX(Übersicht!$L40:$O40)","v":0},{"$f":"Übersicht!O40-MAX(Übersicht!$L40:$O40)","v":0},{"$f":"Übersicht!P40-MAX(Übersicht!$L40:$O40)","v":0},{"$f":"Übersicht!Q40-MAX(Übersicht!$L40:$O40)","v":0},{"$f":"Übersicht!L79-MAX(Übersicht!$L79:$O79)","v":0},{"$f":"Übersicht!M79-MAX(Übersicht!$L79:$O79)","v":0},{"$f":"Übersicht!N79-MAX(Übersicht!$L79:$O79)","v":0},{"$f":"Übersicht!O79-MAX(Übersicht!$L79:$O79)","v":0},{"$f":"Übersicht!P79-MAX(Übersicht!$L79:$O79)","v":0},{"$f":"Übersicht!Q79-MAX(Übersicht!$L79:$O79)","v":0}]
[33,{"$f":"Übersicht!C80-MAX(Übersicht!$C80:$F80)","v":0},{"$f":"Übersicht!D80-MAX(Übersicht!$C80:$F80)","v":0},{"$f":"Übersicht!E80-MAX(Übersicht!$C80:$F80)","v":0},{"$f":"Übersicht!F80-MAX(Übersicht!$C80:$F80)","v":0},{"$f":"Übersicht!G80-MAX(Übersicht!$C80:$F80)","v":0},{"$f":"Übersicht!H80-MAX(Übersicht!$C80:$F80)","v":0},{"$f":"Übersicht!L41-MAX(Übersicht!$L41:$O41)","v":0},{"$f":"Übersicht!M41-MAX(Übersicht!$L41:$O41)","v":0},{"$f":"Übersicht!N41-MAX(Übersicht!$L41:$O41)","v":0},{"$f":"Übersicht!O41-MAX(Übersicht!$L41:$O41)","v":0},{"$f":"Übersicht!P41-MAX(Übersicht!$L41:$O41)","v":0},{"$f":"Übersicht!Q41-MAX(Übersicht!$L41:$O41)","v":0},{"$f":"Übersicht!L80-MAX(Übersicht!$L80:$O80)","v":0},{"$f":"Übersicht!M80-MAX(Übersicht!$L80:$O80)","v":0},{"$f":"Übersicht!N80-MAX(Übersicht!$L80:$O80)","v":0},{"$f":"Übersicht!O80-MAX(Übersicht!$L80:$O80)","v":0},{"$f":"Übersicht!P80-MAX(Übersicht!$L80:$O80)","v":0},{"$f":"Übersicht!Q80-MAX(Übersicht!$L80:$O80)","v":0}]
[34,{"$f":"Übersicht!C81-MAX(Übersicht!$C81:$F81)","v":0},{"$f":"Übersicht!D81-MAX(Übersicht!$C81:$F81)","v":0},{"$f":"Übersicht!E81-MAX(Übersicht!$C81:$F81)","v":0},{"$f":"Übersicht!F81-MAX(Übersicht!$C81:$F81)","v":0},{"$f":"Übersicht!G81-MAX(Übersicht!$C81:$F81)","v":0},{"$f":"Übersicht!H81-MAX(Übersicht!$C81:$F81)","v":0},{"$f":"Übersicht!L42-MAX(Übersicht!$L42:$O42)","v":0},{"$f":"Übersicht!M42-MAX(Übersicht!$L42:$O42)","v":0},{"$f":"Übersicht!N42-MAX(Übersicht!$L42:$O42)","v":0},{"$f":"Übersicht!O42-MAX(Übersicht!$L42:$O42)","v":0},{"$f":"Übersicht!P42-MAX(Übersicht!$L42:$O42)","v":0},{"$f":"Übersicht!Q42-MAX(Übersicht!$L42:$O42)","v":0},{"$f":"Übersicht!L81-MAX(Übersicht!$L81:$O81)","v":0},{"$f":"Übersicht!M81-MAX(Übersicht!$L81:$O81)","v":0},{"$f":"Übersicht!N81-MAX(Übersicht!$L81:$O81)","v":0},{"$f":"Übersicht!O81-MAX(Übersicht!$L81:$O81)","v":0},{"$f":"Übersicht!P81-MAX(Übersicht!$L81:$O81)","v":0},{"$f":"Übersicht!Q81-MAX(Übersicht!$L81:$O81)","v":0}]
[]
[]
[]
[]
[]
[]
[]
[]
[]
[]
[]
[]
[]
[]
[]
[]
[]
[]
[]
[]
[]
[]
[]
[]
[]
[]
[]
[]
[]
[null,null,null,null,null,null,null,null,null,null,null,null,null,null,null,null,null,null,null,null,null,null,null,null,null,null,"D"]

{"sheet":"Tippschein","index":8,"n_rows":11,"n_cols":11,"rows_kept":11,"cut":false,"hidden":false,"merged":[[2,7,2,9],[4,7,4,9]]}
[null,null,{"$f":"Parameter!B15&\" Runde\"","v":"26/27 Runde"},null,1,null,"Spiel",null,null,null,{"$f":"MATCH(1,Runde!AC12:AH12,0)","v":1}]
[]
[null,{"$f":"INDEX(Daten!$A$3:$S$308,Tippschein!$G3,COLUMN())","v":"Fr 20:30"},{"$f":"INDEX(Daten!$A$3:$S$308,Tippschein!$G3,COLUMN())","v":1},{"$f":"INDEX(Daten!$A$3:$S$308,Tippschein!$G3,COLUMN())","v":0},{"$f":"INDEX(Daten!$A$3:$S$308,Tippschein!$G3,COLUMN())","v":0},{"$f":"Runde!E3","v":"00:00:00"},{"$f":"G4-1","v":1},{"$f":"IF(K3=0,\"bereit für Runde \" & Runde!B1,\"Runde \" & Runde!B1 & \" geht an \" & INDEX(Runde!V2:AA2,1,K1))","v":"bereit für Runde 1"},null,null,{"$f":"SUM(Runde!V3:AA11)","v":0}]
[null,{"$f":"INDEX(Daten!$A$3:$S$308,Tippschein!$G4,COLUMN())","v":"Sa 15:30"},{"$f":"INDEX(Daten!$A$3:$S$308,Tippschein!$G4,COLUMN())","v":2},{"$f":"INDEX(Daten!$A$3:$S$308,Tippschein!$G4,COLUMN())","v":0},{"$f":"INDEX(Daten!$A$3:$S$308,Tippschein!$G4,COLUMN())","v":0},null,2]
[null,{"$f":"INDEX(Daten!$A$3:$S$308,Tippschein!$G5,COLUMN())","v":"Sa 15:30"},{"$f":"INDEX(Daten!$A$3:$S$308,Tippschein!$G5,COLUMN())","v":3},{"$f":"INDEX(Daten!$A$3:$S$308,Tippschein!$G5,COLUMN())","v":0},{"$f":"INDEX(Daten!$A$3:$S$308,Tippschein!$G5,COLUMN())","v":0},null,3,"Runde 34 geht an AH\nFrühjahr: MA vor AH und MN"]
[null,{"$f":"INDEX(Daten!$A$3:$S$308,Tippschein!$G6,COLUMN())","v":"Sa 15:30"},{"$f":"INDEX(Daten!$A$3:$S$308,Tippschein!$G6,COLUMN())","v":4},{"$f":"INDEX(Daten!$A$3:$S$308,Tippschein!$G6,COLUMN())","v":0},{"$f":"INDEX(Daten!$A$3:$S$308,Tippschein!$G6,COLUMN())","v":0},null,4]
[null,{"$f":"INDEX(Daten!$A$3:$S$308,Tippschein!$G7,COLUMN())","v":"Sa 15:30"},{"$f":"INDEX(Daten!$A$3:$S$308,Tippschein!$G7,COLUMN())","v":5},{"$f":"INDEX(Daten!$A$3:$S$308,Tippschein!$G7,COLUMN())","v":0},{"$f":"INDEX(Daten!$A$3:$S$308,Tippschein!$G7,COLUMN())","v":0},null,5]
[null,{"$f":"INDEX(Daten!$A$3:$S$308,Tippschein!$G8,COLUMN())","v":"Sa 15:30"},{"$f":"INDEX(Daten!$A$3:$S$308,Tippschein!$G8,COLUMN())","v":6},{"$f":"INDEX(Daten!$A$3:$S$308,Tippschein!$G8,COLUMN())","v":0},{"$f":"INDEX(Daten!$A$3:$S$308,Tippschein!$G8,COLUMN())","v":0},null,6]
[null,{"$f":"INDEX(Daten!$A$3:$S$308,Tippschein!$G9,COLUMN())","v":"Sa 18:30"},{"$f":"INDEX(Daten!$A$3:$S$308,Tippschein!$G9,COLUMN())","v":7},{"$f":"INDEX(Daten!$A$3:$S$308,Tippschein!$G9,COLUMN())","v":0},{"$f":"INDEX(Daten!$A$3:$S$308,Tippschein!$G9,COLUMN())","v":0},null,7]
[null,{"$f":"INDEX(Daten!$A$3:$S$308,Tippschein!$G10,COLUMN())","v":"So 15:30"},{"$f":"INDEX(Daten!$A$3:$S$308,Tippschein!$G10,COLUMN())","v":8},{"$f":"INDEX(Daten!$A$3:$S$308,Tippschein!$G10,COLUMN())","v":0},{"$f":"INDEX(Daten!$A$3:$S$308,Tippschein!$G10,COLUMN())","v":0},null,{"$f":"G11-1","v":8}]
[null,{"$f":"INDEX(Daten!$A$3:$S$308,Tippschein!$G11,COLUMN())","v":"So 17:30"},{"$f":"INDEX(Daten!$A$3:$S$308,Tippschein!$G11,COLUMN())","v":9},{"$f":"INDEX(Daten!$A$3:$S$308,Tippschein!$G11,COLUMN())","v":0},{"$f":"INDEX(Daten!$A$3:$S$308,Tippschein!$G11,COLUMN())","v":0},null,{"$f":"E1*9","v":9}]

{"sheet":"Parameter","index":9,"n_rows":323,"n_cols":56,"rows_kept":323,"cut":false,"hidden":false,"merged":[[70,1,70,12],[0,53,0,54],[0,55,0,56],[0,38,0,39],[0,45,0,46],[0,47,0,48],[0,49,0,50],[0,51,0,52],[0,28,0,29],[0,30,0,31],[0,32,0,33],[0,34,0,35],[0,36,0,37]]}
["Spieleranzahl",{"$f":"SUM(C6:H6)","v":4},"MA","MN","AH","KS","LM","EN",null,null,"MA",null,null,null,null,null,null,null,null,null,null,null,null,null,null,null,"Rd","Sp",{"$f":"C1","v":"MA"},null,{"$f":"D1","v":"MN"},null,{"$f":"E1","v":"AH"},null,{"$f":"F1","v":"KS"},null,{"$f":"G1","v":"LM"},null,{"$f":"H1","v":"EN"},null,null,null,null,"Rd","Sp",{"$f":"AC1","v":"MA"},null,{"$f":"AE1","v":"MN"},null,{"$f":"AG1","v":"AH"},null,{"$f":"AI1","v":"KS"},null,{"$f":"AK1","v":"LM"},null,{"$f":"AM1","v":"EN"}]
["Einsatz Herbst",null,25,25,25,25,null,null,null,null,"MN",null,null,null,null,null,null,null,null,null,null,null,null,null,null,null,"01",1,2,0,3,1,2,1,2,0,null,null,null,null,null,null,null,"01",1,2,0,3,1,2,1,2,1]
["Einsatz Frühjahr",null,25,25,25,25,null,null,null,null,"AH",null,null,null,null,null,null,null,null,null,null,null,null,null,null,null,"01",2,2,1,3,0,2,0,3,1,null,null,null,null,null,null,null,"01",2,2,1,3,0,2,0,2,1]
["Einsatz Jahr",null,0,0,0,0,null,null,null,null,"KS",null,null,null,null,null,null,null,null,null,null,null,null,null,null,null,"01",3,2,0,3,0,2,1,4,0,null,null,null,null,null,null,null,"01",3,2,0,3,0,2,1,2,1]
["aktiv",null,"J","J","J","J","N","N",null,null,"LM",null,null,null,null,null,null,null,null,null,null,null,null,null,null,null,"01",4,2,1,2,1,1,1,2,0,null,null,null,null,null,null,null,"01",4,2,1,2,1,1,1,2,1]
["aktiv",null,{"$f":"IF(C5=\"J\",1,0)","v":1},1,1,1,0,0,null,null,"EN",null,null,null,null,null,null,null,null,null,null,null,null,null,null,null,"01",5,1,0,2,1,2,1,1,1,null,null,null,null,null,null,null,"01",5,1,0,2,1,2,1,2,1]
[null,null,null,null,null,null,null,null,null,null,null,null,null,null,null,null,null,null,null,null,null,null,null,null,null,null,"01",6,2,1,2,1,2,1,2,1,null,null,null,null,null,null,null,"01",6,2,1,2,1,2,1,2,1]
["Rang 1",0.6,null,null,null,null,null,null,null,null,null,null,null,null,null,null,null,null,null,null,null,null,null,null,null,null,"01",7,2,1,2,1,2,1,1,2,null,null,null,null,null,null,null,"01",7,2,1,2,1,2,1,2,1]
["Rang 2",0.3,null,null,null,null,null,null,null,null,null,null,null,null,null,null,null,null,null,null,null,null,null,null,null,null,"01",8,2,1,1,1,1,1,1,1,null,null,null,null,null,null,null,"01",8,2,1,1,1,1,1,2,1]
["Rang 3",0.1,null,null,null,null,null,null,null,null,null,null,null,null,null,null,null,null,null,null,null,null,null,null,null,null,"01",9,1,2,1,3,1,2,2,0,null,null,null,null,null,null,null,"01",9,1,2,1,3,1,2,2,1]
["Rang 4",null,null,null,null,null,null,null,null,null,null,null,null,null,null,null,null,null,null,null,null,null,null,null,null,null,"02",1,0,3,1,3,1,3,0,3,null,null,null,null,null,null,null,"02",1,0,3,1,3,1,3,2,1]
["Rang 5",null,null,null,null,null,null,null,null,null,null,null,null,null,null,null,null,null,null,null,null,null,null,null,null,null,"02",2,1,2,1,2,1,2,1,1,null,null,null,null,null,null,null,"02",2,1,2,1,2,1,2,2,1]
["Rang 6",null,null,null,null,null,null,null,null,null,null,null,null,null,null,null,null,null,null,null,null,null,null,null,null,null,"02",3,1,0,1,0,0,2,2,0,null,null,null,null,null,null,null,"02",3,1,0,1,0,0,2,2,1]
[null,null,null,null,null,null,null,null,null,null,null,null,null,null,null,null,null,null,null,null,null,null,null,null,null,null,"02",4,1,2,1,1,1,2,0,1,null,null,null,null,null,null,null,"02",4,1,2,1,1,1,2,2,1]
["Saison","26/27",null,null,null,null,null,null,null,null,null,null,null,null,null,null,null,null,null,null,null,null,null,null,null,null,"02",5,2,1,1,2,1,1,0,2,null,null,null,null,null,null,null,"02",5,2,1,1,2,1,1,2,1]
["Seidlpreis Herbst",4.5999999999999996,null,null,null,null,null,null,null,null,null,null,null,null,null,null,null,null,null,null,null,null,null,null,null,null,"02",6,2,1,2,1,1,2,2,1,null,null,null,null,null,null,null,"02",6,2,1,2,1,1,2,2,1]
["Seidlpreis Frühjahr",4.5999999999999996,null,null,null,null,null,null,null,null,null,null,null,null,null,null,null,null,null,null,null,null,null,null,null,null,"02",7,1,3,1,3,0,3,1,2,null,null,null,null,null,null,null,"02",7,1,3,1,3,0,3,2,1]
[null,null,null,null,null,null,null,null,null,null,null,null,null,null,null,null,null,null,null,null,null,null,null,null,null,null,"02",8,3,1,3,1,2,1,2,0,null,null,null,null,null,null,null,"02",8,3,1,3,1,2,1,2,1]
[null,null,null,null,null,null,null,null,null,null,null,null,null,null,null,null,null,null,null,null,null,null,null,null,null,null,"02",9,1,2,2,1,1,2,1,1,null,null,null,null,null,null,null,"02",9,1,2,2,1,1,2,2,1]
["Mannschaften","Augsburg",null,null,null,null,null,null,null,null,null,null,null,null,null,null,null,null,null,null,null,null,null,null,null,null,"03",1,1,2,2,2,1,2,1,1,null,null,null,null,null,null,null,"03",1,1,2,2,2,1,2,2,1]
[null,"Bayern",null,null,null,null,null,null,null,null,null,null,null,null,null,null,null,null,null,null,null,null,null,null,null,null,"03",2,2,1,3,0,2,0,3,0,null,null,null,null,null,null,null,"03",2,2,1,3,0,2,0,2,1]
[null,"Berlin",null,null,null,null,null,null,null,null,null,null,null,null,null,null,null,null,null,null,null,null,null,null,null,null,"03",3,2,1,2,1,1,1,2,1,null,null,null,null,null,null,null,"03",3,2,1,2,1,1,1,2,1]
[null,"Bremen",null,null,null,null,null,null,null,null,null,null,null,null,null,null,null,null,null,null,null,null,null,null,null,null,"03",4,1,0,1,2,1,3,2,0,null,null,null,null,null,null,null,"03",4,1,0,1,2,1,3,2,1]
[null,"Dortmund",null,null,null,null,null,null,null,null,null,null,null,null,null,null,null,null,null,null,null,null,null,null,null,null,"03",5,1,1,1,1,2,1,1,0,null,null,null,null,null,null,null,"03",5,1,1,1,1,2,1,2,1]
[null,"Elversberg",null,null,null,null,null,null,null,null,null,null,null,null,null,null,null,null,null,null,null,null,null,null,null,null,"03",6,4,0,3,1,3,0,3,0,null,null,null,null,null,null,null,"03",6,4,0,3,1,3,0,2,1]
[null,"Frankfurt",null,null,null,null,null,null,null,null,null,null,null,null,null,null,null,null,null,null,null,null,null,null,null,null,"03",7,1,3,1,3,1,2,1,3,null,null,null,null,null,null,null,"03",7,1,3,1,3,1,2,2,1]
[null,"Freiburg",null,null,null,null,null,null,null,null,null,null,null,null,null,null,null,null,null,null,null,null,null,null,null,null,"03",8,2,1,2,1,2,2,1,0,null,null,null,null,null,null,null,"03",8,2,1,2,1,2,2,2,1]
[null,"Hamburg",null,null,null,null,null,null,null,null,null,null,null,null,null,null,null,null,null,null,null,null,null,null,null,null,"03",9,2,1,2,1,3,1,2,0,null,null,null,null,null,null,null,"03",9,2,1,2,1,3,1,2,1]
[null,"Hoffenheim",null,null,null,null,null,null,null,null,null,null,null,null,null,null,null,null,null,null,null,null,null,null,null,null,"04",1,1,2,1,2,1,2,0,2,null,null,null,null,null,null,null,"04",1,1,2,1,2,1,2,2,1]
[null,"Köln",null,null,null,null,null,null,null,null,null,null,null,null,null,null,null,null,null,null,null,null,null,null,null,null,"04",2,1,2,2,1,1,1,1,1,null,null,null,null,null,null,null,"04",2,1,2,2,1,1,1,2,1]
[null,"Leipzig",null,null,null,null,null,null,null,null,null,null,null,null,null,null,null,null,null,null,null,null,null,null,null,null,"04",3,1,0,2,1,1,2,1,0,null,null,null,null,null,null,null,"04",3,1,0,2,1,1,2,2,1]
[null,"Leverkusen",null,null,null,null,null,null,null,null,null,null,null,null,null,null,null,null,null,null,null,null,null,null,null,null,"04",4,3,2,2,1,2,1,2,2,null,null,null,null,null,null,null,"04",4,3,2,2,1,2,1,2,1]
[null,"Mainz",null,null,null,null,null,null,null,null,null,null,null,null,null,null,null,null,null,null,null,null,null,null,null,null,"04",5,1,2,1,2,0,3,1,2,null,null,null,null,null,null,null,"04",5,1,2,1,2,0,3,2,1]
[null,"M'Gladbach",null,null,null,null,null,null,null,null,null,null,null,null,null,null,null,null,null,null,null,null,null,null,null,null,"04",6,1,2,1,2,0,2,1,1,null,null,null,null,null,null,null,"04",6,1,2,1,2,0,2,2,1]
[null,"Paderborn",null,null,null,null,null,null,null,null,null,null,null,null,null,null,null,null,null,null,null,null,null,null,null,null,"04",7,2,3,2,3,2,3,2,1,null,null,null,null,null,null,null,"04",7,2,3,2,3,2,3,2,1]
[null,"Schalke",null,null,null,null,null,null,null,null,null,null,null,null,null,null,null,null,null,null,null,null,null,null,null,null,"04",8,2,1,3,1,0,2,0,0,null,null,null,null,null,null,null,"04",8,2,1,3,1,0,2,2,1]
[null,"Stuttgart",null,null,null,null,null,null,null,null,null,null,null,null,null,null,null,null,null,null,null,null,null,null,null,null,"04",9,1,2,1,2,1,2,0,1,null,null,null,null,null,null,null,"04",9,1,2,1,2,1,2,2,1]
[null,null,null,null,null,null,null,null,null,null,null,null,null,null,null,null,null,null,null,null,null,null,null,null,null,null,"05",1,3,1,2,1,2,1,3,0,null,null,null,null,null,null,null,"05",1,3,1,2,1,2,1,2,1]
[null,null,null,null,null,null,null,null,null,null,null,null,null,null,null,null,null,null,null,null,null,null,null,null,null,null,"05",2,2,1,2,1,3,0,3,1,null,null,null,null,null,null,null,"05",2,2,1,2,1,3,0,2,1]
["Berechnen",true,null,null,null,null,null,null,null,null,null,null,null,null,null,null,null,null,null,null,null,null,null,null,null,null,"05",3,2,1,3,1,1,1,4,0,null,null,null,null,null,null,null,"05",3,2,1,3,1,1,1,2,1]
[null,null,null,null,null,null,null,null,null,null,null,null,null,null,null,null,null,null,null,null,null,null,null,null,null,null,"05",4,4,1,4,0,3,1,5,0,null,null,null,null,null,null,null,"05",4,4,1,4,0,3,1,2,1]
[null,null,null,null,null,null,null,null,null,null,null,null,null,null,null,null,null,null,null,null,null,null,null,null,null,null,"05",5,2,1,2,0,2,1,2,1,null,null,null,null,null,null,null,"05",5,2,1,2,0,2,1,2,1]
[null,null,null,null,null,null,null,null,null,null,null,null,null,null,null,null,null,null,null,null,null,null,null,null,null,null,"05",6,1,2,1,3,1,2,1,2,null,null,null,null,null,null,null,"05",6,1,2,1,3,1,2,2,1]
[null,null,null,null,null,null,null,null,null,null,null,null,null,null,null,null,null,null,null,null,null,null,null,null,null,null,"05",7,2,1,3,0,2,1,2,0,null,null,null,null,null,null,null,"05",7,2,1,3,0,2,1,2,1]
["Tipps",null,null,null,null,null,null,null,null,null,null,null,null,null,null,null,null,null,null,null,null,null,null,null,null,null,"05",8,1,3,1,2,0,2,1,3,null,null,null,null,null,null,null,"05",8,1,3,1,2,0,2,2,1]
[null,0,null,null,null,null,null,null,null,null,null,null,null,null,null,null,null,null,null,null,null,null,null,null,null,null,"05",9,2,1,2,1,2,1,2,0,null,null,null,null,null,null,null,"05",9,2,1,2,1,2,1,2,1]
[null,1,null,null,null,null,null,null,null,null,null,null,null,null,null,null,null,null,null,null,null,null,null,null,null,null,"06",1,1,2,1,2,1,3,1,1,null,null,null,null,null,null,null,"06",1,1,2,1,2,1,3,2,1]
[null,2,null,null,null,null,null,null,null,null,null,null,null,null,null,null,null,null,null,null,null,null,null,null,null,null,"06",2,1,2,2,1,1,2,1,0,null,null,null,null,null,null,null,"06",2,1,2,2,1,1,2,2,1]
[null,3,null,null,null,null,null,null,null,null,null,null,null,null,null,null,null,null,null,null,null,null,null,null,null,null,"06",3,1,2,1,2,1,2,0,2,null,null,null,null,null,null,null,"06",3,1,2,1,2,1,2,2,1]
[null,4,null,null,null,null,null,null,null,null,null,null,null,null,null,null,null,null,null,null,null,null,null,null,null,null,"06",4,1,2,1,2,1,2,1,3,null,null,null,null,null,null,null,"06",4,1,2,1,2,1,2,2,1]
[null,5,null,null,null,null,null,null,null,null,null,null,null,null,null,null,null,null,null,null,null,null,null,null,null,null,"06",5,2,1,3,1,3,1,2,2,null,null,null,null,null,null,null,"06",5,2,1,3,1,3,1,2,1]
[null,6,null,null,null,null,null,null,null,null,null,null,null,null,null,null,null,null,null,null,null,null,null,null,null,null,"06",6,1,4,0,4,1,3,0,4,null,null,null,null,null,null,null,"06",6,1,4,0,4,1,3,2,1]
[null,7,null,null,null,null,null,null,null,null,null,null,null,null,null,null,null,null,null,null,null,null,null,null,null,null,"06",7,3,0,3,1,2,1,4,0,null,null,null,null,null,null,null,"06",7,3,0,3,1,2,1,2,1]
[null,8,null,null,null,null,null,null,null,null,null,null,null,null,null,null,null,null,null,null,null,null,null,null,null,null,"06",8,2,0,2,1,1,3,0,3,null,null,null,null,null,null,null,"06",8,2,0,2,1,1,3,2,1]
[null,9,null,null,null,null,null,null,null,null,null,null,null,null,null,null,null,null,null,null,null,null,null,null,null,null,"06",9,2,1,2,1,1,2,0,0,null,null,null,null,null,null,null,"06",9,2,1,2,1,1,2,2,1]
[null,null,null,null,null,null,null,null,null,null,null,null,null,null,null,null,null,null,null,null,null,null,null,null,null,null,"07",1,2,1,2,1,2,1,2,0,null,null,null,null,null,null,null,"07",1,2,1,2,1,2,1,2,1]
[null,6,null,null,null,null,null,null,null,null,null,null,null,null,null,null,null,null,null,null,null,null,null,null,null,null,"07",2,1,2,1,3,1,2,1,1,null,null,null,null,null,null,null,"07",2,1,2,1,3,1,2,2,1]
["Tore",null,null,null,null,null,null,null,null,null,null,null,null,null,null,null,null,null,null,null,null,null,null,null,null,null,"07",3,3,1,4,1,3,0,3,1,null,null,null,null,null,null,null,"07",3,3,1,4,1,3,0,2,1]
["Tordifferenz",null,null,null,null,null,null,null,null,null,null,null,null,null,null,null,null,null,null,null,null,null,null,null,null,null,"07",4,1,1,2,1,1,2,1,0,null,null,null,null,null,null,null,"07",4,1,1,2,1,1,2,2,1]
["genaue Treffer",null,null,null,null,null,null,null,null,null,null,null,null,null,null,null,null,null,null,null,null,null,null,null,null,null,"07",5,1,3,1,2,1,2,2,2,null,null,null,null,null,null,null,"07",5,1,3,1,2,1,2,2,1]
["Trends",null,null,null,null,null,null,null,null,null,null,null,null,null,null,null,null,null,null,null,null,null,null,null,null,null,"07",6,2,0,2,0,3,1,3,0,null,null,null,null,null,null,null,"07",6,2,0,2,0,3,1,2,1]
["nicht getroffen",null,null,null,null,null,null,null,null,null,null,null,null,null,null,null,null,null,null,null,null,null,null,null,null,null,"07",7,2,1,2,1,2,1,2,0,null,null,null,null,null,null,null,"07",7,2,1,2,1,2,1,2,1]
["Abstände",null,null,null,null,null,null,null,null,null,null,null,null,null,null,null,null,null,null,null,null,null,null,null,null,null,"07",8,2,0,2,0,2,1,3,1,null,null,null,null,null,null,null,"07",8,2,0,2,0,2,1,2,1]
[null,null,null,null,null,null,null,null,null,null,null,null,null,null,null,null,null,null,null,null,null,null,null,null,null,null,"07",9,2,1,2,1,2,1,2,1,null,null,null,null,null,null,null,"07",9,2,1,2,1,2,1,2,1]
[null,null,null,null,null,null,null,null,null,null,null,null,null,null,null,null,null,null,null,null,null,null,null,null,null,null,"08",1,2,1,1,2,1,2,2,1,null,null,null,null,null,null,null,"08",1,2,1,1,2,1,2,2,1]
[null,null,null,null,null,null,null,null,null,null,null,null,null,null,null,null,null,null,null,null,null,null,null,null,null,null,"08",2,2,1,1,0,1,2,1,1,null,null,null,null,null,null,null,"08",2,2,1,1,0,1,2,2,1]
[null,null,null,null,null,null,null,null,null,null,null,null,null,null,null,null,null,null,null,null,null,null,null,null,null,null,"08",3,1,2,1,2,1,3,0,2,null,null,null,null,null,null,null,"08",3,1,2,1,2,1,3,2,1]
[null,null,null,null,null,null,null,null,null,null,null,null,null,null,null,null,null,null,null,null,null,null,null,null,null,null,"08",4,1,3,1,3,0,3,1,4,null,null,null,null,null,null,null,"08",4,1,3,1,3,0,3,2,1]
[null,null,null,null,null,null,null,null,null,null,null,null,null,null,null,null,null,null,null,null,null,null,null,null,null,null,"08",5,1,1,2,1,1,2,2,1,null,null,null,null,null,null,null,"08",5,1,1,2,1,1,2,2,1]
[null,null,null,null,null,null,null,null,null,null,null,null,null,null,null,null,null,null,null,null,null,null,null,null,null,null,"08",6,2,1,2,1,1,2,2,2,null,null,null,null,null,null,null,"08",6,2,1,2,1,1,2,2,1]
[null,null,null,null,null,null,null,null,null,null,null,null,null,null,null,null,null,null,null,null,null,null,null,null,null,null,"08",7,2,1,2,1,1,2,2,1,null,null,null,null,null,null,null,"08",7,2,1,2,1,1,2,2,1]
[null,null,null,null,null,null,null,null,null,null,null,null,null,null,null,null,null,null,null,null,null,null,null,null,null,null,"08",8,1,0,2,0,2,1,1,0,null,null,null,null,null,null,null,"08",8,1,0,2,0,2,1,2,1]
[null,null,null,null,null,null,null,null,null,null,null,null,null,null,null,null,null,null,null,null,null,null,null,null,null,null,"08",9,1,2,1,1,1,2,1,3,null,null,null,null,null,null,null,"08",9,1,2,1,1,1,2,2,1]
[null,null,null,null,null,null,null,null,null,null,null,null,null,null,null,null,null,null,null,null,null,null,null,null,null,null,"09",1,1,0,2,1,2,1,1,1,null,null,null,null,null,null,null,"09",1,1,0,2,1,2,1,2,1]
[null,null,null,null,null,null,null,null,null,null,null,null,null,null,null,null,null,null,null,null,null,null,null,null,null,null,"09",2,1,2,1,2,1,2,1,1,null,null,null,null,null,null,null,"09",2,1,2,1,2,1,2,2,1]
[null,null,null,null,null,null,null,null,null,null,null,null,null,null,null,null,null,null,null,null,null,null,null,null,null,null,"09",3,3,0,4,1,2,1,3,0,null,null,null,null,null,null,null,"09",3,3,0,4,1,2,1,2,1]
[null,null,null,null,null,null,null,null,null,null,null,null,null,null,null,null,null,null,null,null,null,null,null,null,null,null,"09",4,1,2,1,1,1,2,1,1,null,null,null,null,null,null,null,"09",4,1,2,1,1,1,2,2,1]
[null,null,null,null,null,null,null,null,null,null,null,null,null,null,null,null,null,null,null,null,null,null,null,null,null,null,"09",5,2,1,2,1,1,1,1,1,null,null,null,null,null,null,null,"09",5,2,1,2,1,1,1,2,1]
[null,null,null,null,null,null,null,null,null,null,null,null,null,null,null,null,null,null,null,null,null,null,null,null,null,null,"09",6,1,2,1,2,1,2,0,1,null,null,null,null,null,null,null,"09",6,1,2,1,2,1,2,2,1]
[null,null,null,null,null,null,null,null,null,null,null,null,null,null,null,null,null,null,null,null,null,null,null,null,null,null,"09",7,2,1,2,1,2,1,2,0,null,null,null,null,null,null,null,"09",7,2,1,2,1,2,1,2,1]
[null,null,null,null,null,null,null,null,null,null,null,null,null,null,null,null,null,null,null,null,null,null,null,null,null,null,"09",8,2,1,2,1,3,1,3,0,null,null,null,null,null,null,null,"09",8,2,1,2,1,3,1,2,1]
[null,null,null,null,null,null,null,null,null,null,null,null,null,null,null,null,null,null,null,null,null,null,null,null,null,null,"09",9,2,1,2,1,2,1,2,1,null,null,null,null,null,null,null,"09",9,2,1,2,1,2,1,2,1]
[null,null,null,null,null,null,null,null,null,null,null,null,null,null,null,null,null,null,null,null,null,null,null,null,null,null,"10",1,2,1,3,1,2,1,2,0,null,null,null,null,null,null,null,"10",1,2,1,3,1,2,1,2,1]
[null,null,null,null,null,null,null,null,null,null,null,null,null,null,null,null,null,null,null,null,null,null,null,null,null,null,"10",2,2,1,2,2,1,2,1,0,null,null,null,null,null,null,null,"10",2,2,1,2,2,1,2,2,1]
[null,null,null,null,null,null,null,null,null,null,null,null,null,null,null,null,null,null,null,null,null,null,null,null,null,null,"10",3,2,1,2,1,1,2,1,1,null,null,null,null,null,null,null,"10",3,2,1,2,1,1,2,2,1]
[null,null,null,null,null,null,null,null,null,null,null,null,null,null,null,null,null,null,null,null,null,null,null,null,null,null,"10",4,1,2,1,2,1,2,1,3,null,null,null,null,null,null,null,"10",4,1,2,1,2,1,2,2,1]
[null,null,null,null,null,null,null,null,null,null,null,null,null,null,null,null,null,null,null,null,null,null,null,null,null,null,"10",5,2,1,3,1,2,1,3,0,null,null,null,null,null,null,null,"10",5,2,1,3,1,2,1,2,1]
[null,null,null,null,null,null,null,null,null,null,null,null,null,null,null,null,null,null,null,null,null,null,null,null,null,null,"10",6,2,1,2,1,1,2,1,1,null,null,null,null,null,null,null,"10",6,2,1,2,1,1,2,2,1]
[null,null,null,null,null,null,null,null,null,null,null,null,null,null,null,null,null,null,null,null,null,null,null,null,null,null,"10",7,2,1,1,2,2,1,1,2,null,null,null,null,null,null,null,"10",7,2,1,1,2,2,1,2,1]
[null,null,null,null,null,null,null,null,null,null,null,null,null,null,null,null,null,null,null,null,null,null,null,null,null,null,"10",8,2,1,1,1,1,1,1,0,null,null,null,null,null,null,null,"10",8,2,1,1,1,1,1,2,1]
[null,null,null,null,null,null,null,null,null,null,null,null,null,null,null,null,null,null,null,null,null,null,null,null,null,null,"10",9,1,2,1,1,1,2,0,2,null,null,null,null,null,null,null,"10",9,1,2,1,1,1,2,2,1]
[null,null,null,null,null,null,null,null,null,null,null,null,null,null,null,null,null,null,null,null,null,null,null,null,null,null,"11",1,1,2,1,2,1,2,0,2,null,null,null,null,null,null,null,"11",1,1,2,1,2,1,2,2,1]
[null,null,null,null,null,null,null,null,null,null,null,null,null,null,null,null,null,null,null,null,null,null,null,null,null,null,"11",2,2,1,2,1,1,2,1,0,null,null,null,null,null,null,null,"11",2,2,1,2,1,1,2,2,1]
[null,null,null,null,null,null,null,null,null,null,null,null,null,null,null,null,null,null,null,null,null,null,null,null,null,null,"11",3,2,0,2,0,2,1,3,0,null,null,null,null,null,null,null,"11",3,2,0,2,0,2,1,2,1]
[null,null,null,null,null,null,null,null,null,null,null,null,null,null,null,null,null,null,null,null,null,null,null,null,null,null,"11",4,1,3,1,3,1,2,1,3,null,null,null,null,null,null,null,"11",4,1,3,1,3,1,2,2,1]
[null,null,null,null,null,null,null,null,null,null,null,null,null,null,null,null,null,null,null,null,null,null,null,null,null,null,"11",5,1,0,2,1,1,2,1,1,null,null,null,null,null,null,null,"11",5,1,0,2,1,1,2,2,1]
[null,null,null,null,null,null,null,null,null,null,null,null,null,null,null,null,null,null,null,null,null,null,null,null,null,null,"11",6,3,1,2,1,2,1,2,1,null,null,null,null,null,null,null,"11",6,3,1,2,1,2,1,2,1]
[null,null,null,null,null,null,null,null,null,null,null,null,null,null,null,null,null,null,null,null,null,null,null,null,null,null,"11",7,2,0,2,1,2,1,4,1,null,null,null,null,null,null,null,"11",7,2,0,2,1,2,1,2,1]
[null,null,null,null,null,null,null,null,null,null,null,null,null,null,null,null,null,null,null,null,null,null,null,null,null,null,"11",8,2,1,1,1,2,1,2,0,null,null,null,null,null,null,null,"11",8,2,1,1,1,2,1,2,1]
[null,null,null,null,null,null,null,null,null,null,null,null,null,null,null,null,null,null,null,null,null,null,null,null,null,null,"11",9,1,2,2,1,1,2,1,1,null,null,null,null,null,null,null,"11",9,1,2,2,1,1,2,2,1]
[null,null,null,null,null,null,null,null,null,null,null,null,null,null,null,null,null,null,null,null,null,null,null,null,null,null,"12",1,3,0,3,1,3,0,4,0,null,null,null,null,null,null,null,"12",1,3,0,3,1,3,0,2,1]
[null,null,null,null,null,null,null,null,null,null,null,null,null,null,null,null,null,null,null,null,null,null,null,null,null,null,"12",2,2,1,2,1,1,2,1,1,null,null,null,null,null,null,null,"12",2,2,1,2,1,1,2,2,1]
[null,null,null,null,null,null,null,null,null,null,null,null,null,null,null,null,null,null,null,null,null,null,null,null,null,null,"12",3,2,1,2,1,2,1,2,1,null,null,null,null,null,null,null,"12",3,2,1,2,1,2,1,2,1]
[null,null,null,null,null,null,null,null,null,null,null,null,null,null,null,null,null,null,null,null,null,null,null,null,null,null,"12",4,1,2,1,2,1,3,0,3,null,null,null,null,null,null,null,"12",4,1,2,1,2,1,3,2,1]
[null,null,null,null,null,null,null,null,null,null,null,null,null,null,null,null,null,null,null,null,null,null,null,null,null,null,"12",5,1,4,0,3,1,2,0,2,null,null,null,null,null,null,null,"12",5,1,4,0,3,1,2,2,1]
[null,null,null,null,null,null,null,null,null,null,null,null,null,null,null,null,null,null,null,null,null,null,null,null,null,null,"12",6,2,1,1,2,1,2,1,3,null,null,null,null,null,null,null,"12",6,2,1,1,2,1,2,2,1]
[null,null,null,null,null,null,null,null,null,null,null,null,null,null,null,null,null,null,null,null,null,null,null,null,null,null,"12",7,2,1,3,0,2,1,5,0,null,null,null,null,null,null,null,"12",7,2,1,3,0,2,1,2,1]
[null,null,null,null,null,null,null,null,null,null,null,null,null,null,null,null,null,null,null,null,null,null,null,null,null,null,"12",8,1,2,1,1,1,2,0,2,null,null,null,null,null,null,null,"12",8,1,2,1,1,1,2,2,1]
[null,null,null,null,null,null,null,null,null,null,null,null,null,null,null,null,null,null,null,null,null,null,null,null,null,null,"12",9,2,1,2,0,2,1,3,0,null,null,null,null,null,null,null,"12",9,2,1,2,0,2,1,2,1]
[null,null,null,null,null,null,null,null,null,null,null,null,null,null,null,null,null,null,null,null,null,null,null,null,null,null,"13",1,2,1,3,1,2,1,2,0,null,null,null,null,null,null,null,"13",1,2,1,3,1,2,1,2,1]
[null,null,null,null,null,null,null,null,null,null,null,null,null,null,null,null,null,null,null,null,null,null,null,null,null,null,"13",2,1,3,1,3,2,1,0,3,null,null,null,null,null,null,null,"13",2,1,3,1,3,2,1,2,1]
[null,null,null,null,null,null,null,null,null,null,null,null,null,null,null,null,null,null,null,null,null,null,null,null,null,null,"13",3,1,3,1,3,1,2,0,4,null,null,null,null,null,null,null,"13",3,1,3,1,3,1,2,2,1]
[null,null,null,null,null,null,null,null,null,null,null,null,null,null,null,null,null,null,null,null,null,null,null,null,null,null,"13",4,2,1,2,0,2,1,2,0,null,null,null,null,null,null,null,"13",4,2,1,2,0,2,1,2,1]
[null,null,null,null,null,null,null,null,null,null,null,null,null,null,null,null,null,null,null,null,null,null,null,null,null,null,"13",5,1,2,1,1,1,2,2,2,null,null,null,null,null,null,null,"13",5,1,2,1,1,1,2,2,1]
[null,null,null,null,null,null,null,null,null,null,null,null,null,null,null,null,null,null,null,null,null,null,null,null,null,null,"13",6,3,1,3,1,2,1,3,1,null,null,null,null,null,null,null,"13",6,3,1,3,1,2,1,2,1]
[null,null,null,null,null,null,null,null,null,null,null,null,null,null,null,null,null,null,null,null,null,null,null,null,null,null,"13",7,2,0,2,1,2,1,2,1,null,null,null,null,null,null,null,"13",7,2,0,2,1,2,1,2,1]
[null,null,null,null,null,null,null,null,null,null,null,null,null,null,null,null,null,null,null,null,null,null,null,null,null,null,"13",8,2,1,2,0,2,1,2,0,null,null,null,null,null,null,null,"13",8,2,1,2,0,2,1,2,1]
[null,null,null,null,null,null,null,null,null,null,null,null,null,null,null,null,null,null,null,null,null,null,null,null,null,null,"13",9,1,2,1,2,1,2,1,3,null,null,null,null,null,null,null,"13",9,1,2,1,2,1,2,2,1]
[null,null,null,null,null,null,null,null,null,null,null,null,null,null,null,null,null,null,null,null,null,null,null,null,null,null,"14",1,2,1,2,1,2,1,2,1,null,null,null,null,null,null,null,"14",1,2,1,2,1,2,1,2,1]
[null,null,null,null,null,null,null,null,null,null,null,null,null,null,null,null,null,null,null,null,null,null,null,null,null,null,"14",2,1,3,1,2,1,2,1,1,null,null,null,null,null,null,null,"14",2,1,3,1,2,1,2,2,1]
[null,null,null,null,null,null,null,null,null,null,null,null,null,null,null,null,null,null,null,null,null,null,null,null,null,null,"14",3,2,1,2,1,2,1,2,0,null,null,null,null,null,null,null,"14",3,2,1,2,1,2,1,2,1]
[null,null,null,null,null,null,null,null,null,null,null,null,null,null,null,null,null,null,null,null,null,null,null,null,null,null,"14",4,2,1,1,2,1,2,2,2,null,null,null,null,null,null,null,"14",4,2,1,1,2,1,2,2,1]
[null,null,null,null,null,null,null,null,null,null,null,null,null,null,null,null,null,null,null,null,null,null,null,null,null,null,"14",5,3,1,3,1,2,1,3,0,null,null,null,null,null,null,null,"14",5,3,1,3,1,2,1,2,1]
[null,null,null,null,null,null,null,null,null,null,null,null,null,null,null,null,null,null,null,null,null,null,null,null,null,null,"14",6,2,0,3,1,2,1,4,0,null,null,null,null,null,null,null,"14",6,2,0,3,1,2,1,2,1]
[null,null,null,null,null,null,null,null,null,null,null,null,null,null,null,null,null,null,null,null,null,null,null,null,null,null,"14",7,1,2,2,1,1,2,1,1,null,null,null,null,null,null,null,"14",7,1,2,2,1,1,2,2,1]
[null,null,null,null,null,null,null,null,null,null,null,null,null,null,null,null,null,null,null,null,null,null,null,null,null,null,"14",8,1,0,2,1,2,1,0,0,null,null,null,null,null,null,null,"14",8,1,0,2,1,2,1,2,1]
[null,null,null,null,null,null,null,null,null,null,null,null,null,null,null,null,null,null,null,null,null,null,null,null,null,null,"14",9,2,1,2,1,2,1,2,1,null,null,null,null,null,null,null,"14",9,2,1,2,1,2,1,2,1]
[null,null,null,null,null,null,null,null,null,null,null,null,null,null,null,null,null,null,null,null,null,null,null,null,null,null,"15",1,2,1,2,1,2,1,2,0,null,null,null,null,null,null,null,"15",1,2,1,2,1,2,1,2,1]
[null,null,null,null,null,null,null,null,null,null,null,null,null,null,null,null,null,null,null,null,null,null,null,null,null,null,"15",2,1,2,0,2,1,2,0,3,null,null,null,null,null,null,null,"15",2,1,2,0,2,1,2,2,1]
[null,null,null,null,null,null,null,null,null,null,null,null,null,null,null,null,null,null,null,null,null,null,null,null,null,null,"15",3,1,2,1,2,1,2,0,4,null,null,null,null,null,null,null,"15",3,1,2,1,2,1,2,2,1]
[null,null,null,null,null,null,null,null,null,null,null,null,null,null,null,null,null,null,null,null,null,null,null,null,null,null,"15",4,3,0,4,0,2,1,2,0,null,null,null,null,null,null,null,"15",4,3,0,4,0,2,1,2,1]
[null,null,null,null,null,null,null,null,null,null,null,null,null,null,null,null,null,null,null,null,null,null,null,null,null,null,"15",5,2,1,2,1,1,2,0,3,null,null,null,null,null,null,null,"15",5,2,1,2,1,1,2,2,1]
[null,null,null,null,null,null,null,null,null,null,null,null,null,null,null,null,null,null,null,null,null,null,null,null,null,null,"15",6,1,1,1,1,1,2,2,1,null,null,null,null,null,null,null,"15",6,1,1,1,1,1,2,2,1]
[null,null,null,null,null,null,null,null,null,null,null,null,null,null,null,null,null,null,null,null,null,null,null,null,null,null,"15",7,0,3,1,3,1,2,0,3,null,null,null,null,null,null,null,"15",7,0,3,1,3,1,2,2,1]
[null,null,null,null,null,null,null,null,null,null,null,null,null,null,null,null,null,null,null,null,null,null,null,null,null,null,"15",8,1,2,2,1,1,2,1,3,null,null,null,null,null,null,null,"15",8,1,2,2,1,1,2,2,1]
[null,null,null,null,null,null,null,null,null,null,null,null,null,null,null,null,null,null,null,null,null,null,null,null,null,null,"15",9,2,1,2,1,2,1,2,0,null,null,null,null,null,null,null,"15",9,2,1,2,1,2,1,2,1]
[null,null,null,null,null,null,null,null,null,null,null,null,null,null,null,null,null,null,null,null,null,null,null,null,null,null,"16",1,2,1,2,1,1,2,1,0,null,null,null,null,null,null,null,"16",1,2,1,2,1,1,2,2,1]
[null,null,null,null,null,null,null,null,null,null,null,null,null,null,null,null,null,null,null,null,null,null,null,null,null,null,"16",2,3,2,1,2,1,2,2,1,null,null,null,null,null,null,null,"16",2,3,2,1,2,1,2,2,1]
[null,null,null,null,null,null,null,null,null,null,null,null,null,null,null,null,null,null,null,null,null,null,null,null,null,null,"16",3,1,2,2,1,2,1,2,0,null,null,null,null,null,null,null,"16",3,1,2,2,1,2,1,2,1]
[null,null,null,null,null,null,null,null,null,null,null,null,null,null,null,null,null,null,null,null,null,null,null,null,null,null,"16",4,2,1,2,1,2,1,2,1,null,null,null,null,null,null,null,"16",4,2,1,2,1,2,1,2,1]
[null,null,null,null,null,null,null,null,null,null,null,null,null,null,null,null,null,null,null,null,null,null,null,null,null,null,"16",5,2,1,2,1,2,1,2,0,null,null,null,null,null,null,null,"16",5,2,1,2,1,2,1,2,1]
[null,null,null,null,null,null,null,null,null,null,null,null,null,null,null,null,null,null,null,null,null,null,null,null,null,null,"16",6,1,4,1,3,1,2,2,2,null,null,null,null,null,null,null,"16",6,1,4,1,3,1,2,2,1]
[null,null,null,null,null,null,null,null,null,null,null,null,null,null,null,null,null,null,null,null,null,null,null,null,null,null,"16",7,2,1,2,0,2,1,3,0,null,null,null,null,null,null,null,"16",7,2,1,2,0,2,1,2,1]
[null,null,null,null,null,null,null,null,null,null,null,null,null,null,null,null,null,null,null,null,null,null,null,null,null,null,"16",8,2,1,2,1,2,1,1,1,null,null,null,null,null,null,null,"16",8,2,1,2,1,2,1,2,1]
[null,null,null,null,null,null,null,null,null,null,null,null,null,null,null,null,null,null,null,null,null,null,null,null,null,null,"16",9,2,1,2,1,1,2,0,0,null,null,null,null,null,null,null,"16",9,2,1,2,1,1,2,2,1]
[null,null,null,null,null,null,null,null,null,null,null,null,null,null,null,null,null,null,null,null,null,null,null,null,null,null,"17",1,1,2,1,2,0,3,0,2,null,null,null,null,null,null,null,"17",1,1,2,1,2,0,3,2,1]
[null,null,null,null,null,null,null,null,null,null,null,null,null,null,null,null,null,null,null,null,null,null,null,null,null,null,"17",2,1,2,2,1,1,2,1,3,null,null,null,null,null,null,null,"17",2,1,2,2,1,1,2,2,1]
[null,null,null,null,null,null,null,null,null,null,null,null,null,null,null,null,null,null,null,null,null,null,null,null,null,null,"17",3,3,1,4,1,3,1,2,0,null,null,null,null,null,null,null,"17",3,3,1,4,1,3,1,2,1]
[null,null,null,null,null,null,null,null,null,null,null,null,null,null,null,null,null,null,null,null,null,null,null,null,null,null,"17",4,2,1,2,1,2,1,1,1,null,null,null,null,null,null,null,"17",4,2,1,2,1,2,1,2,1]
[null,null,null,null,null,null,null,null,null,null,null,null,null,null,null,null,null,null,null,null,null,null,null,null,null,null,"17",5,2,1,1,1,2,1,2,0,null,null,null,null,null,null,null,"17",5,2,1,1,1,2,1,2,1]
[null,null,null,null,null,null,null,null,null,null,null,null,null,null,null,null,null,null,null,null,null,null,null,null,null,null,"17",6,3,1,3,1,2,0,3,0,null,null,null,null,null,null,null,"17",6,3,1,3,1,2,0,2,1]
[null,null,null,null,null,null,null,null,null,null,null,null,null,null,null,null,null,null,null,null,null,null,null,null,null,null,"17",7,1,2,1,2,1,2,0,3,null,null,null,null,null,null,null,"17",7,1,2,1,2,1,2,2,1]
[null,null,null,null,null,null,null,null,null,null,null,null,null,null,null,null,null,null,null,null,null,null,null,null,null,null,"17",8,2,1,1,0,0,2,2,1,null,null,null,null,null,null,null,"17",8,2,1,1,0,0,2,2,1]
[null,null,null,null,null,null,null,null,null,null,null,null,null,null,null,null,null,null,null,null,null,null,null,null,null,null,"17",9,1,2,1,2,0,2,1,1,null,null,null,null,null,null,null,"17",9,1,2,1,2,0,2,2,1]
[null,null,null,null,null,null,null,null,null,null,null,null,null,null,null,null,null,null,null,null,null,null,null,null,null,null,"18",1,2,1,1,2,1,3,2,1,null,null,null,null,null,null,null,"18",1,2,1,1,2,1,3,2,1]
[null,null,null,null,null,null,null,null,null,null,null,null,null,null,null,null,null,null,null,null,null,null,null,null,null,null,"18",2,2,1,2,1,2,1,2,0,null,null,null,null,null,null,null,"18",2,2,1,2,1,2,1,2,1]
[null,null,null,null,null,null,null,null,null,null,null,null,null,null,null,null,null,null,null,null,null,null,null,null,null,null,"18",3,1,2,1,2,0,3,1,3,null,null,null,null,null,null,null,"18",3,1,2,1,2,0,3,2,1]
[null,null,null,null,null,null,null,null,null,null,null,null,null,null,null,null,null,null,null,null,null,null,null,null,null,null,"18",4,2,1,1,0,1,2,1,1,null,null,null,null,null,null,null,"18",4,2,1,1,0,1,2,2,1]
[null,null,null,null,null,null,null,null,null,null,null,null,null,null,null,null,null,null,null,null,null,null,null,null,null,null,"18",5,2,1,1,2,0,2,0,1,null,null,null,null,null,null,null,"18",5,2,1,1,2,0,2,2,1]
[null,null,null,null,null,null,null,null,null,null,null,null,null,null,null,null,null,null,null,null,null,null,null,null,null,null,"18",6,1,2,1,1,0,2,1,2,null,null,null,null,null,null,null,"18",6,1,2,1,1,0,2,2,1]
[null,null,null,null,null,null,null,null,null,null,null,null,null,null,null,null,null,null,null,null,null,null,null,null,null,null,"18",7,2,0,3,1,3,1,2,0,null,null,null,null,null,null,null,"18",7,2,0,3,1,3,1,2,1]
[null,null,null,null,null,null,null,null,null,null,null,null,null,null,null,null,null,null,null,null,null,null,null,null,null,null,"18",8,1,3,1,3,0,3,1,1,null,null,null,null,null,null,null,"18",8,1,3,1,3,0,3,2,1]
[null,null,null,null,null,null,null,null,null,null,null,null,null,null,null,null,null,null,null,null,null,null,null,null,null,null,"18",9,1,2,1,3,0,2,0,2,null,null,null,null,null,null,null,"18",9,1,2,1,3,0,2,2,1]
[null,null,null,null,null,null,null,null,null,null,null,null,null,null,null,null,null,null,null,null,null,null,null,null,null,null,"19",1,null,null,null,null,null,null,null,null,null,null,null,null,null,null,null,"19",1]
[null,null,null,null,null,null,null,null,null,null,null,null,null,null,null,null,null,null,null,null,null,null,null,null,null,null,"19",2,null,null,null,null,null,null,null,null,null,null,null,null,null,null,null,"19",2]
[null,null,null,null,null,null,null,null,null,null,null,null,null,null,null,null,null,null,null,null,null,null,null,null,null,null,"19",3,null,null,null,null,null,null,null,null,null,null,null,null,null,null,null,"19",3]
[null,null,null,null,null,null,null,null,null,null,null,null,null,null,null,null,null,null,null,null,null,null,null,null,null,null,"19",4,null,null,null,null,null,null,null,null,null,null,null,null,null,null,null,"19",4]
[null,null,null,null,null,null,null,null,null,null,null,null,null,null,null,null,null,null,null,null,null,null,null,null,null,null,"19",5,null,null,null,null,null,null,null,null,null,null,null,null,null,null,null,"19",5]
[null,null,null,null,null,null,null,null,null,null,null,null,null,null,null,null,null,null,null,null,null,null,null,null,null,null,"19",6,null,null,null,null,null,null,null,null,null,null,null,null,null,null,null,"19",6]
[null,null,null,null,null,null,null,null,null,null,null,null,null,null,null,null,null,null,null,null,null,null,null,null,null,null,"19",7,null,null,null,null,null,null,null,null,null,null,null,null,null,null,null,"19",7]
[null,null,null,null,null,null,null,null,null,null,null,null,null,null,null,null,null,null,null,null,null,null,null,null,null,null,"19",8,null,null,null,null,null,null,null,null,null,null,null,null,null,null,null,"19",8]
[null,null,null,null,null,null,null,null,null,null,null,null,null,null,null,null,null,null,null,null,null,null,null,null,null,null,"19",9,null,null,null,null,null,null,null,null,null,null,null,null,null,null,null,"19",9]
[null,null,null,null,null,null,null,null,null,null,null,null,null,null,null,null,null,null,null,null,null,null,null,null,null,null,"20",1,null,null,null,null,null,null,null,null,null,null,null,null,null,null,null,"20",1]
[null,null,null,null,null,null,null,null,null,null,null,null,null,null,null,null,null,null,null,null,null,null,null,null,null,null,"20",2,null,null,null,null,null,null,null,null,null,null,null,null,null,null,null,"20",2]
[null,null,null,null,null,null,null,null,null,null,null,null,null,null,null,null,null,null,null,null,null,null,null,null,null,null,"20",3,null,null,null,null,null,null,null,null,null,null,null,null,null,null,null,"20",3]
[null,null,null,null,null,null,null,null,null,null,null,null,null,null,null,null,null,null,null,null,null,null,null,null,null,null,"20",4,null,null,null,null,null,null,null,null,null,null,null,null,null,null,null,"20",4]
[null,null,null,null,null,null,null,null,null,null,null,null,null,null,null,null,null,null,null,null,null,null,null,null,null,null,"20",5,null,null,null,null,null,null,null,null,null,null,null,null,null,null,null,"20",5]
[null,null,null,null,null,null,null,null,null,null,null,null,null,null,null,null,null,null,null,null,null,null,null,null,null,null,"20",6,null,null,null,null,null,null,null,null,null,null,null,null,null,null,null,"20",6]
[null,null,null,null,null,null,null,null,null,null,null,null,null,null,null,null,null,null,null,null,null,null,null,null,null,null,"20",7,null,null,null,null,null,null,null,null,null,null,null,null,null,null,null,"20",7]
[null,null,null,null,null,null,null,null,null,null,null,null,null,null,null,null,null,null,null,null,null,null,null,null,null,null,"20",8,null,null,null,null,null,null,null,null,null,null,null,null,null,null,null,"20",8]
[null,null,null,null,null,null,null,null,null,null,null,null,null,null,null,null,null,null,null,null,null,null,null,null,null,null,"20",9,null,null,null,null,null,null,null,null,null,null,null,null,null,null,null,"20",9]
[null,null,null,null,null,null,null,null,null,null,null,null,null,null,null,null,null,null,null,null,null,null,null,null,null,null,"21",1,null,null,null,null,null,null,null,null,null,null,null,null,null,null,null,"21",1]
[null,null,null,null,null,null,null,null,null,null,null,null,null,null,null,null,null,null,null,null,null,null,null,null,null,null,"21",2,null,null,null,null,null,null,null,null,null,null,null,null,null,null,null,"21",2]
[null,null,null,null,null,null,null,null,null,null,null,null,null,null,null,null,null,null,null,null,null,null,null,null,null,null,"21",3,null,null,null,null,null,null,null,null,null,null,null,null,null,null,null,"21",3]
[null,null,null,null,null,null,null,null,null,null,null,null,null,null,null,null,null,null,null,null,null,null,null,null,null,null,"21",4,null,null,null,null,null,null,null,null,null,null,null,null,null,null,null,"21",4]
[null,null,null,null,null,null,null,null,null,null,null,null,null,null,null,null,null,null,null,null,null,null,null,null,null,null,"21",5,null,null,null,null,null,null,null,null,null,null,null,null,null,null,null,"21",5]
[null,null,null,null,null,null,null,null,null,null,null,null,null,null,null,null,null,null,null,null,null,null,null,null,null,null,"21",6,null,null,null,null,null,null,null,null,null,null,null,null,null,null,null,"21",6]
[null,null,null,null,null,null,null,null,null,null,null,null,null,null,null,null,null,null,null,null,null,null,null,null,null,null,"21",7,null,null,null,null,null,null,null,null,null,null,null,null,null,null,null,"21",7]
[null,null,null,null,null,null,null,null,null,null,null,null,null,null,null,null,null,null,null,null,null,null,null,null,null,null,"21",8,null,null,null,null,null,null,null,null,null,null,null,null,null,null,null,"21",8]
[null,null,null,null,null,null,null,null,null,null,null,null,null,null,null,null,null,null,null,null,null,null,null,null,null,null,"21",9,null,null,null,null,null,null,null,null,null,null,null,null,null,null,null,"21",9]
[null,null,null,null,null,null,null,null,null,null,null,null,null,null,null,null,null,null,null,null,null,null,null,null,null,null,"22",1,null,null,null,null,null,null,null,null,null,null,null,null,null,null,null,"22",1]
[null,null,null,null,null,null,null,null,null,null,null,null,null,null,null,null,null,null,null,null,null,null,null,null,null,null,"22",2,null,null,null,null,null,null,null,null,null,null,null,null,null,null,null,"22",2]
[null,null,null,null,null,null,null,null,null,null,null,null,null,null,null,null,null,null,null,null,null,null,null,null,null,null,"22",3,null,null,null,null,null,null,null,null,null,null,null,null,null,null,null,"22",3]
[null,null,null,null,null,null,null,null,null,null,null,null,null,null,null,null,null,null,null,null,null,null,null,null,null,null,"22",4,null,null,null,null,null,null,null,null,null,null,null,null,null,null,null,"22",4]
[null,null,null,null,null,null,null,null,null,null,null,null,null,null,null,null,null,null,null,null,null,null,null,null,null,null,"22",5,null,null,null,null,null,null,null,null,null,null,null,null,null,null,null,"22",5]
[null,null,null,null,null,null,null,null,null,null,null,null,null,null,null,null,null,null,null,null,null,null,null,null,null,null,"22",6,null,null,null,null,null,null,null,null,null,null,null,null,null,null,null,"22",6]
[null,null,null,null,null,null,null,null,null,null,null,null,null,null,null,null,null,null,null,null,null,null,null,null,null,null,"22",7,null,null,null,null,null,null,null,null,null,null,null,null,null,null,null,"22",7]
[null,null,null,null,null,null,null,null,null,null,null,null,null,null,null,null,null,null,null,null,null,null,null,null,null,null,"22",8,null,null,null,null,null,null,null,null,null,null,null,null,null,null,null,"22",8]
[null,null,null,null,null,null,null,null,null,null,null,null,null,null,null,null,null,null,null,null,null,null,null,null,null,null,"22",9,null,null,null,null,null,null,null,null,null,null,null,null,null,null,null,"22",9]
[null,null,null,null,null,null,null,null,null,null,null,null,null,null,null,null,null,null,null,null,null,null,null,null,null,null,"23",1,null,null,null,null,null,null,null,null,null,null,null,null,null,null,null,"23",1]
[null,null,null,null,null,null,null,null,null,null,null,null,null,null,null,null,null,null,null,null,null,null,null,null,null,null,"23",2,null,null,null,null,null,null,null,null,null,null,null,null,null,null,null,"23",2]
[null,null,null,null,null,null,null,null,null,null,null,null,null,null,null,null,null,null,null,null,null,null,null,null,null,null,"23",3,null,null,null,null,null,null,null,null,null,null,null,null,null,null,null,"23",3]
[null,null,null,null,null,null,null,null,null,null,null,null,null,null,null,null,null,null,null,null,null,null,null,null,null,null,"23",4,null,null,null,null,null,null,null,null,null,null,null,null,null,null,null,"23",4]
[null,null,null,null,null,null,null,null,null,null,null,null,null,null,null,null,null,null,null,null,null,null,null,null,null,null,"23",5,null,null,null,null,null,null,null,null,null,null,null,null,null,null,null,"23",5]
[null,null,null,null,null,null,null,null,null,null,null,null,null,null,null,null,null,null,null,null,null,null,null,null,null,null,"23",6,null,null,null,null,null,null,null,null,null,null,null,null,null,null,null,"23",6]
[null,null,null,null,null,null,null,null,null,null,null,null,null,null,null,null,null,null,null,null,null,null,null,null,null,null,"23",7,null,null,null,null,null,null,null,null,null,null,null,null,null,null,null,"23",7]
[null,null,null,null,null,null,null,null,null,null,null,null,null,null,null,null,null,null,null,null,null,null,null,null,null,null,"23",8,null,null,null,null,null,null,null,null,null,null,null,null,null,null,null,"23",8]
[null,null,null,null,null,null,null,null,null,null,null,null,null,null,null,null,null,null,null,null,null,null,null,null,null,null,"23",9,null,null,null,null,null,null,null,null,null,null,null,null,null,null,null,"23",9]
[null,null,null,null,null,null,null,null,null,null,null,null,null,null,null,null,null,null,null,null,null,null,null,null,null,null,"24",1,null,null,null,null,null,null,null,null,null,null,null,null,null,null,null,"24",1]
[null,null,null,null,null,null,null,null,null,null,null,null,null,null,null,null,null,null,null,null,null,null,null,null,null,null,"24",2,null,null,null,null,null,null,null,null,null,null,null,null,null,null,null,"24",2]
[null,null,null,null,null,null,null,null,null,null,null,null,null,null,null,null,null,null,null,null,null,null,null,null,null,null,"24",3,null,null,null,null,null,null,null,null,null,null,null,null,null,null,null,"24",3]
[null,null,null,null,null,null,null,null,null,null,null,null,null,null,null,null,null,null,null,null,null,null,null,null,null,null,"24",4,null,null,null,null,null,null,null,null,null,null,null,null,null,null,null,"24",4]
[null,null,null,null,null,null,null,null,null,null,null,null,null,null,null,null,null,null,null,null,null,null,null,null,null,null,"24",5,null,null,null,null,null,null,null,null,null,null,null,null,null,null,null,"24",5]
[null,null,null,null,null,null,null,null,null,null,null,null,null,null,null,null,null,null,null,null,null,null,null,null,null,null,"24",6,null,null,null,null,null,null,null,null,null,null,null,null,null,null,null,"24",6]
[null,null,null,null,null,null,null,null,null,null,null,null,null,null,null,null,null,null,null,null,null,null,null,null,null,null,"24",7,null,null,null,null,null,null,null,null,null,null,null,null,null,null,null,"24",7]
[null,null,null,null,null,null,null,null,null,null,null,null,null,null,null,null,null,null,null,null,null,null,null,null,null,null,"24",8,null,null,null,null,null,null,null,null,null,null,null,null,null,null,null,"24",8]
[null,null,null,null,null,null,null,null,null,null,null,null,null,null,null,null,null,null,null,null,null,null,null,null,null,null,"24",9,null,null,null,null,null,null,null,null,null,null,null,null,null,null,null,"24",9]
[null,null,null,null,null,null,null,null,null,null,null,null,null,null,null,null,null,null,null,null,null,null,null,null,null,null,"25",1,null,null,null,null,null,null,null,null,null,null,null,null,null,null,null,"25",1]
[null,null,null,null,null,null,null,null,null,null,null,null,null,null,null,null,null,null,null,null,null,null,null,null,null,null,"25",2,null,null,null,null,null,null,null,null,null,null,null,null,null,null,null,"25",2]
[null,null,null,null,null,null,null,null,null,null,null,null,null,null,null,null,null,null,null,null,null,null,null,null,null,null,"25",3,null,null,null,null,null,null,null,null,null,null,null,null,null,null,null,"25",3]
[null,null,null,null,null,null,null,null,null,null,null,null,null,null,null,null,null,null,null,null,null,null,null,null,null,null,"25",4,null,null,null,null,null,null,null,null,null,null,null,null,null,null,null,"25",4]
[null,null,null,null,null,null,null,null,null,null,null,null,null,null,null,null,null,null,null,null,null,null,null,null,null,null,"25",5,null,null,null,null,null,null,null,null,null,null,null,null,null,null,null,"25",5]
[null,null,null,null,null,null,null,null,null,null,null,null,null,null,null,null,null,null,null,null,null,null,null,null,null,null,"25",6,null,null,null,null,null,null,null,null,null,null,null,null,null,null,null,"25",6]
[null,null,null,null,null,null,null,null,null,null,null,null,null,null,null,null,null,null,null,null,null,null,null,null,null,null,"25",7,null,null,null,null,null,null,null,null,null,null,null,null,null,null,null,"25",7]
[null,null,null,null,null,null,null,null,null,null,null,null,null,null,null,null,null,null,null,null,null,null,null,null,null,null,"25",8,null,null,null,null,null,null,null,null,null,null,null,null,null,null,null,"25",8]
[null,null,null,null,null,null,null,null,null,null,null,null,null,null,null,null,null,null,null,null,null,null,null,null,null,null,"25",9,null,null,null,null,null,null,null,null,null,null,null,null,null,null,null,"25",9]
[null,null,null,null,null,null,null,null,null,null,null,null,null,null,null,null,null,null,null,null,null,null,null,null,null,null,"26",1,null,null,null,null,null,null,null,null,null,null,null,null,null,null,null,"26",1]
[null,null,null,null,null,null,null,null,null,null,null,null,null,null,null,null,null,null,null,null,null,null,null,null,null,null,"26",2,null,null,null,null,null,null,null,null,null,null,null,null,null,null,null,"26",2]
[null,null,null,null,null,null,null,null,null,null,null,null,null,null,null,null,null,null,null,null,null,null,null,null,null,null,"26",3,null,null,null,null,null,null,null,null,null,null,null,null,null,null,null,"26",3]
[null,null,null,null,null,null,null,null,null,null,null,null,null,null,null,null,null,null,null,null,null,null,null,null,null,null,"26",4,null,null,null,null,null,null,null,null,null,null,null,null,null,null,null,"26",4]
[null,null,null,null,null,null,null,null,null,null,null,null,null,null,null,null,null,null,null,null,null,null,null,null,null,null,"26",5,null,null,null,null,null,null,null,null,null,null,null,null,null,null,null,"26",5]
[null,null,null,null,null,null,null,null,null,null,null,null,null,null,null,null,null,null,null,null,null,null,null,null,null,null,"26",6,null,null,null,null,null,null,null,null,null,null,null,null,null,null,null,"26",6]
[null,null,null,null,null,null,null,null,null,null,null,null,null,null,null,null,null,null,null,null,null,null,null,null,null,null,"26",7,null,null,null,null,null,null,null,null,null,null,null,null,null,null,null,"26",7]
[null,null,null,null,null,null,null,null,null,null,null,null,null,null,null,null,null,null,null,null,null,null,null,null,null,null,"26",8,null,null,null,null,null,null,null,null,null,null,null,null,null,null,null,"26",8]
[null,null,null,null,null,null,null,null,null,null,null,null,null,null,null,null,null,null,null,null,null,null,null,null,null,null,"26",9,null,null,null,null,null,null,null,null,null,null,null,null,null,null,null,"26",9]
[null,null,null,null,null,null,null,null,null,null,null,null,null,null,null,null,null,null,null,null,null,null,null,null,null,null,"27",1,null,null,null,null,null,null,null,null,null,null,null,null,null,null,null,"27",1]
[null,null,null,null,null,null,null,null,null,null,null,null,null,null,null,null,null,null,null,null,null,null,null,null,null,null,"27",2,null,null,null,null,null,null,null,null,null,null,null,null,null,null,null,"27",2]
[null,null,null,null,null,null,null,null,null,null,null,null,null,null,null,null,null,null,null,null,null,null,null,null,null,null,"27",3,null,null,null,null,null,null,null,null,null,null,null,null,null,null,null,"27",3]
[null,null,null,null,null,null,null,null,null,null,null,null,null,null,null,null,null,null,null,null,null,null,null,null,null,null,"27",4,null,null,null,null,null,null,null,null,null,null,null,null,null,null,null,"27",4]
[null,null,null,null,null,null,null,null,null,null,null,null,null,null,null,null,null,null,null,null,null,null,null,null,null,null,"27",5,null,null,null,null,null,null,null,null,null,null,null,null,null,null,null,"27",5]
[null,null,null,null,null,null,null,null,null,null,null,null,null,null,null,null,null,null,null,null,null,null,null,null,null,null,"27",6,null,null,null,null,null,null,null,null,null,null,null,null,null,null,null,"27",6]
[null,null,null,null,null,null,null,null,null,null,null,null,null,null,null,null,null,null,null,null,null,null,null,null,null,null,"27",7,null,null,null,null,null,null,null,null,null,null,null,null,null,null,null,"27",7]
[null,null,null,null,null,null,null,null,null,null,null,null,null,null,null,null,null,null,null,null,null,null,null,null,null,null,"27",8,null,null,null,null,null,null,null,null,null,null,null,null,null,null,null,"27",8]
[null,null,null,null,null,null,null,null,null,null,null,null,null,null,null,null,null,null,null,null,null,null,null,null,null,null,"27",9,null,null,null,null,null,null,null,null,null,null,null,null,null,null,null,"27",9]
[null,null,null,null,null,null,null,null,null,null,null,null,null,null,null,null,null,null,null,null,null,null,null,null,null,null,"28",1,null,null,null,null,null,null,null,null,null,null,null,null,null,null,null,"28",1]
[null,null,null,null,null,null,null,null,null,null,null,null,null,null,null,null,null,null,null,null,null,null,null,null,null,null,"28",2,null,null,null,null,null,null,null,null,null,null,null,null,null,null,null,"28",2]
[null,null,null,null,null,null,null,null,null,null,null,null,null,null,null,null,null,null,null,null,null,null,null,null,null,null,"28",3,null,null,null,null,null,null,null,null,null,null,null,null,null,null,null,"28",3]
[null,null,null,null,null,null,null,null,null,null,null,null,null,null,null,null,null,null,null,null,null,null,null,null,null,null,"28",4,null,null,null,null,null,null,null,null,null,null,null,null,null,null,null,"28",4]
[null,null,null,null,null,null,null,null,null,null,null,null,null,null,null,null,null,null,null,null,null,null,null,null,null,null,"28",5,null,null,null,null,null,null,null,null,null,null,null,null,null,null,null,"28",5]
[null,null,null,null,null,null,null,null,null,null,null,null,null,null,null,null,null,null,null,null,null,null,null,null,null,null,"28",6,null,null,null,null,null,null,null,null,null,null,null,null,null,null,null,"28",6]
[null,null,null,null,null,null,null,null,null,null,null,null,null,null,null,null,null,null,null,null,null,null,null,null,null,null,"28",7,null,null,null,null,null,null,null,null,null,null,null,null,null,null,null,"28",7]
[null,null,null,null,null,null,null,null,null,null,null,null,null,null,null,null,null,null,null,null,null,null,null,null,null,null,"28",8,null,null,null,null,null,null,null,null,null,null,null,null,null,null,null,"28",8]
[null,null,null,null,null,null,null,null,null,null,null,null,null,null,null,null,null,null,null,null,null,null,null,null,null,null,"28",9,null,null,null,null,null,null,null,null,null,null,null,null,null,null,null,"28",9]
[null,null,null,null,null,null,null,null,null,null,null,null,null,null,null,null,null,null,null,null,null,null,null,null,null,null,"29",1,null,null,null,null,null,null,null,null,null,null,null,null,null,null,null,"29",1]
[null,null,null,null,null,null,null,null,null,null,null,null,null,null,null,null,null,null,null,null,null,null,null,null,null,null,"29",2,null,null,null,null,null,null,null,null,null,null,null,null,null,null,null,"29",2]
[null,null,null,null,null,null,null,null,null,null,null,null,null,null,null,null,null,null,null,null,null,null,null,null,null,null,"29",3,null,null,null,null,null,null,null,null,null,null,null,null,null,null,null,"29",3]
[null,null,null,null,null,null,null,null,null,null,null,null,null,null,null,null,null,null,null,null,null,null,null,null,null,null,"29",4,null,null,null,null,null,null,null,null,null,null,null,null,null,null,null,"29",4]
[null,null,null,null,null,null,null,null,null,null,null,null,null,null,null,null,null,null,null,null,null,null,null,null,null,null,"29",5,null,null,null,null,null,null,null,null,null,null,null,null,null,null,null,"29",5]
[null,null,null,null,null,null,null,null,null,null,null,null,null,null,null,null,null,null,null,null,null,null,null,null,null,null,"29",6,null,null,null,null,null,null,null,null,null,null,null,null,null,null,null,"29",6]
[null,null,null,null,null,null,null,null,null,null,null,null,null,null,null,null,null,null,null,null,null,null,null,null,null,null,"29",7,null,null,null,null,null,null,null,null,null,null,null,null,null,null,null,"29",7]
[null,null,null,null,null,null,null,null,null,null,null,null,null,null,null,null,null,null,null,null,null,null,null,null,null,null,"29",8,null,null,null,null,null,null,null,null,null,null,null,null,null,null,null,"29",8]
[null,null,null,null,null,null,null,null,null,null,null,null,null,null,null,null,null,null,null,null,null,null,null,null,null,null,"29",9,null,null,null,null,null,null,null,null,null,null,null,null,null,null,null,"29",9]
[null,null,null,null,null,null,null,null,null,null,null,null,null,null,null,null,null,null,null,null,null,null,null,null,null,null,"30",1,null,null,null,null,null,null,null,null,null,null,null,null,null,null,null,"30",1]
[null,null,null,null,null,null,null,null,null,null,null,null,null,null,null,null,null,null,null,null,null,null,null,null,null,null,"30",2,null,null,null,null,null,null,null,null,null,null,null,null,null,null,null,"30",2]
[null,null,null,null,null,null,null,null,null,null,null,null,null,null,null,null,null,null,null,null,null,null,null,null,null,null,"30",3,null,null,null,null,null,null,null,null,null,null,null,null,null,null,null,"30",3]
[null,null,null,null,null,null,null,null,null,null,null,null,null,null,null,null,null,null,null,null,null,null,null,null,null,null,"30",4,null,null,null,null,null,null,null,null,null,null,null,null,null,null,null,"30",4]
[null,null,null,null,null,null,null,null,null,null,null,null,null,null,null,null,null,null,null,null,null,null,null,null,null,null,"30",5,null,null,null,null,null,null,null,null,null,null,null,null,null,null,null,"30",5]
[null,null,null,null,null,null,null,null,null,null,null,null,null,null,null,null,null,null,null,null,null,null,null,null,null,null,"30",6,null,null,null,null,null,null,null,null,null,null,null,null,null,null,null,"30",6]
[null,null,null,null,null,null,null,null,null,null,null,null,null,null,null,null,null,null,null,null,null,null,null,null,null,null,"30",7,null,null,null,null,null,null,null,null,null,null,null,null,null,null,null,"30",7]
[null,null,null,null,null,null,null,null,null,null,null,null,null,null,null,null,null,null,null,null,null,null,null,null,null,null,"30",8,null,null,null,null,null,null,null,null,null,null,null,null,null,null,null,"30",8]
[null,null,null,null,null,null,null,null,null,null,null,null,null,null,null,null,null,null,null,null,null,null,null,null,null,null,"30",9,null,null,null,null,null,null,null,null,null,null,null,null,null,null,null,"30",9]
[null,null,null,null,null,null,null,null,null,null,null,null,null,null,null,null,null,null,null,null,null,null,null,null,null,null,"31",1,null,null,null,null,null,null,null,null,null,null,null,null,null,null,null,"31",1]
[null,null,null,null,null,null,null,null,null,null,null,null,null,null,null,null,null,null,null,null,null,null,null,null,null,null,"31",2,null,null,null,null,null,null,null,null,null,null,null,null,null,null,null,"31",2]
[null,null,null,null,null,null,null,null,null,null,null,null,null,null,null,null,null,null,null,null,null,null,null,null,null,null,"31",3,null,null,null,null,null,null,null,null,null,null,null,null,null,null,null,"31",3]
[null,null,null,null,null,null,null,null,null,null,null,null,null,null,null,null,null,null,null,null,null,null,null,null,null,null,"31",4,null,null,null,null,null,null,null,null,null,null,null,null,null,null,null,"31",4]
[null,null,null,null,null,null,null,null,null,null,null,null,null,null,null,null,null,null,null,null,null,null,null,null,null,null,"31",5,null,null,null,null,null,null,null,null,null,null,null,null,null,null,null,"31",5]
[null,null,null,null,null,null,null,null,null,null,null,null,null,null,null,null,null,null,null,null,null,null,null,null,null,null,"31",6,null,null,null,null,null,null,null,null,null,null,null,null,null,null,null,"31",6]
[null,null,null,null,null,null,null,null,null,null,null,null,null,null,null,null,null,null,null,null,null,null,null,null,null,null,"31",7,null,null,null,null,null,null,null,null,null,null,null,null,null,null,null,"31",7]
[null,null,null,null,null,null,null,null,null,null,null,null,null,null,null,null,null,null,null,null,null,null,null,null,null,null,"31",8,null,null,null,null,null,null,null,null,null,null,null,null,null,null,null,"31",8]
[null,null,null,null,null,null,null,null,null,null,null,null,null,null,null,null,null,null,null,null,null,null,null,null,null,null,"31",9,null,null,null,null,null,null,null,null,null,null,null,null,null,null,null,"31",9]
[null,null,null,null,null,null,null,null,null,null,null,null,null,null,null,null,null,null,null,null,null,null,null,null,null,null,"32",1,null,null,null,null,null,null,null,null,null,null,null,null,null,null,null,"32",1]
[null,null,null,null,null,null,null,null,null,null,null,null,null,null,null,null,null,null,null,null,null,null,null,null,null,null,"32",2,null,null,null,null,null,null,null,null,null,null,null,null,null,null,null,"32",2]
[null,null,null,null,null,null,null,null,null,null,null,null,null,null,null,null,null,null,null,null,null,null,null,null,null,null,"32",3,null,null,null,null,null,null,null,null,null,null,null,null,null,null,null,"32",3]
[null,null,null,null,null,null,null,null,null,null,null,null,null,null,null,null,null,null,null,null,null,null,null,null,null,null,"32",4,null,null,null,null,null,null,null,null,null,null,null,null,null,null,null,"32",4]
[null,null,null,null,null,null,null,null,null,null,null,null,null,null,null,null,null,null,null,null,null,null,null,null,null,null,"32",5,null,null,null,null,null,null,null,null,null,null,null,null,null,null,null,"32",5]
[null,null,null,null,null,null,null,null,null,null,null,null,null,null,null,null,null,null,null,null,null,null,null,null,null,null,"32",6,null,null,null,null,null,null,null,null,null,null,null,null,null,null,null,"32",6]
[null,null,null,null,null,null,null,null,null,null,null,null,null,null,null,null,null,null,null,null,null,null,null,null,null,null,"32",7,null,null,null,null,null,null,null,null,null,null,null,null,null,null,null,"32",7]
[null,null,null,null,null,null,null,null,null,null,null,null,null,null,null,null,null,null,null,null,null,null,null,null,null,null,"32",8,null,null,null,null,null,null,null,null,null,null,null,null,null,null,null,"32",8]
[null,null,null,null,null,null,null,null,null,null,null,null,null,null,null,null,null,null,null,null,null,null,null,null,null,null,"32",9,null,null,null,null,null,null,null,null,null,null,null,null,null,null,null,"32",9]
[null,null,null,null,null,null,null,null,null,null,null,null,null,null,null,null,null,null,null,null,null,null,null,null,null,null,"33",1,null,null,null,null,null,null,null,null,null,null,null,null,null,null,null,"33",1]
[null,null,null,null,null,null,null,null,null,null,null,null,null,null,null,null,null,null,null,null,null,null,null,null,null,null,"33",2,null,null,null,null,null,null,null,null,null,null,null,null,null,null,null,"33",2]
[null,null,null,null,null,null,null,null,null,null,null,null,null,null,null,null,null,null,null,null,null,null,null,null,null,null,"33",3,null,null,null,null,null,null,null,null,null,null,null,null,null,null,null,"33",3]
[null,null,null,null,null,null,null,null,null,null,null,null,null,null,null,null,null,null,null,null,null,null,null,null,null,null,"33",4,null,null,null,null,null,null,null,null,null,null,null,null,null,null,null,"33",4]
[null,null,null,null,null,null,null,null,null,null,null,null,null,null,null,null,null,null,null,null,null,null,null,null,null,null,"33",5,null,null,null,null,null,null,null,null,null,null,null,null,null,null,null,"33",5]
[null,null,null,null,null,null,null,null,null,null,null,null,null,null,null,null,null,null,null,null,null,null,null,null,null,null,"33",6,null,null,null,null,null,null,null,null,null,null,null,null,null,null,null,"33",6]
[null,null,null,null,null,null,null,null,null,null,null,null,null,null,null,null,null,null,null,null,null,null,null,null,null,null,"33",7,null,null,null,null,null,null,null,null,null,null,null,null,null,null,null,"33",7]
[null,null,null,null,null,null,null,null,null,null,null,null,null,null,null,null,null,null,null,null,null,null,null,null,null,null,"33",8,null,null,null,null,null,null,null,null,null,null,null,null,null,null,null,"33",8]
[null,null,null,null,null,null,null,null,null,null,null,null,null,null,null,null,null,null,null,null,null,null,null,null,null,null,"33",9,null,null,null,null,null,null,null,null,null,null,null,null,null,null,null,"33",9]
[null,null,null,null,null,null,null,null,null,null,null,null,null,null,null,null,null,null,null,null,null,null,null,null,null,null,"34",1,null,null,null,null,null,null,null,null,null,null,null,null,null,null,null,"34",1]
[null,null,null,null,null,null,null,null,null,null,null,null,null,null,null,null,null,null,null,null,null,null,null,null,null,null,"34",2,null,null,null,null,null,null,null,null,null,null,null,null,null,null,null,"34",2]
[null,null,null,null,null,null,null,null,null,null,null,null,null,null,null,null,null,null,null,null,null,null,null,null,null,null,"34",3,null,null,null,null,null,null,null,null,null,null,null,null,null,null,null,"34",3]
[null,null,null,null,null,null,null,null,null,null,null,null,null,null,null,null,null,null,null,null,null,null,null,null,null,null,"34",4,null,null,null,null,null,null,null,null,null,null,null,null,null,null,null,"34",4]
[null,null,null,null,null,null,null,null,null,null,null,null,null,null,null,null,null,null,null,null,null,null,null,null,null,null,"34",5,null,null,null,null,null,null,null,null,null,null,null,null,null,null,null,"34",5]
[null,null,null,null,null,null,null,null,null,null,null,null,null,null,null,null,null,null,null,null,null,null,null,null,null,null,"34",6,null,null,null,null,null,null,null,null,null,null,null,null,null,null,null,"34",6]
[null,null,null,null,null,null,null,null,null,null,null,null,null,null,null,null,null,null,null,null,null,null,null,null,null,null,"34",7,null,null,null,null,null,null,null,null,null,null,null,null,null,null,null,"34",7]
[null,null,null,null,null,null,null,null,null,null,null,null,null,null,null,null,null,null,null,null,null,null,null,null,null,null,"34",8,null,null,null,null,null,null,null,null,null,null,null,null,null,null,null,"34",8]
[null,null,null,null,null,null,null,null,null,null,null,null,null,null,null,null,null,null,null,null,null,null,null,null,null,null,"34",9,null,null,null,null,null,null,null,null,null,null,null,null,null,null,null,"34",9]
[]
[]
[]
[]
[null,null,null,null,null,null,null,null,null,null,null,null,null,null,{"$f":"#REF!","v":{"$error":"#REF!"}},{"$f":"#REF!","v":{"$error":"#REF!"}},{"$f":"#REF!","v":{"$error":"#REF!"}},{"$f":"#REF!","v":{"$error":"#REF!"}}]
[null,null,null,null,null,null,null,null,null,null,null,null,null,null,{"$f":"#REF!","v":{"$error":"#REF!"}},{"$f":"#REF!","v":{"$error":"#REF!"}},{"$f":"#REF!","v":{"$error":"#REF!"}},{"$f":"#REF!","v":{"$error":"#REF!"}}]
[null,null,null,null,null,null,null,null,null,null,null,null,null,null,{"$f":"#REF!","v":{"$error":"#REF!"}},{"$f":"#REF!","v":{"$error":"#REF!"}},{"$f":"#REF!","v":{"$error":"#REF!"}},{"$f":"#REF!","v":{"$error":"#REF!"}}]
[null,null,null,null,null,null,null,null,null,null,null,null,null,null,{"$f":"#REF!","v":{"$error":"#REF!"}},{"$f":"#REF!","v":{"$error":"#REF!"}},{"$f":"#REF!","v":{"$error":"#REF!"}},{"$f":"#REF!","v":{"$error":"#REF!"}}]
[null,null,null,null,null,null,null,null,null,null,null,null,null,null,{"$f":"#REF!","v":{"$error":"#REF!"}},{"$f":"#REF!","v":{"$error":"#REF!"}},{"$f":"#REF!","v":{"$error":"#REF!"}},{"$f":"#REF!","v":{"$error":"#REF!"}}]
[null,null,null,null,null,null,null,null,null,null,null,null,null,null,{"$f":"#REF!","v":{"$error":"#REF!"}},{"$f":"#REF!","v":{"$error":"#REF!"}},{"$f":"#REF!","v":{"$error":"#REF!"}},{"$f":"#REF!","v":{"$error":"#REF!"}}]
[null,null,null,null,null,null,null,null,null,null,null,null,null,null,{"$f":"#REF!","v":{"$error":"#REF!"}},{"$f":"#REF!","v":{"$error":"#REF!"}},{"$f":"#REF!","v":{"$error":"#REF!"}},{"$f":"#REF!","v":{"$error":"#REF!"}}]
[null,null,null,null,null,null,null,null,null,null,null,null,null,null,{"$f":"#REF!","v":{"$error":"#REF!"}},{"$f":"#REF!","v":{"$error":"#REF!"}},{"$f":"#REF!","v":{"$error":"#REF!"}},{"$f":"#REF!","v":{"$error":"#REF!"}}]
[null,null,null,null,null,null,null,null,null,null,null,null,null,null,{"$f":"#REF!","v":{"$error":"#REF!"}},{"$f":"#REF!","v":{"$error":"#REF!"}},{"$f":"#REF!","v":{"$error":"#REF!"}},{"$f":"#REF!","v":{"$error":"#REF!"}}]
[]
[]
[null,null,null,null,null,null,null,null,null,null,null,null,null,null,"Runde",{"$f":"#REF!","v":{"$error":"#REF!"}}]